Jump to content

Erros during the maketest for OpenSSL3 using dark_pyrro guide on installing Python3


Max101

Recommended Posts

Ive failed three times and am pretty new to Linux on this level. Any help would be appreciated, see my errors below:

      test/helpers/ssl_test-bin-ssl_test_ctx.o \
        test/ssl_test-bin-ssl_test.o \
        -lssl test/libtestutil.a -lcrypto -ldl -pthread -latomic
gcc  -Iinclude -Iinclude -Iapps/include  -pthread -march=armv7-a -Wa,--noexecstack -Wall -O3 -fPIC -DOPENSSL_BUILDING_OPENSSL -DNDEBUG  -MMD -MF test/helpers/ssl_test_ctx_test-bin-ssl_test_ctx.d.tmp -MT test/helpers/ssl_test_ctx_test-bin-ssl_test_ctx.o -c -o test/helpers/ssl_test_ctx_test-bin-ssl_test_ctx.o test/helpers/ssl_test_ctx.c
gcc  -Iinclude -Iapps/include  -pthread -march=armv7-a -Wa,--noexecstack -Wall -O3 -fPIC -DOPENSSL_BUILDING_OPENSSL -DNDEBUG  -MMD -MF test/ssl_test_ctx_test-bin-ssl_test_ctx_test.d.tmp -MT test/ssl_test_ctx_test-bin-ssl_test_ctx_test.o -c -o test/ssl_test_ctx_test-bin-ssl_test_ctx_test.o test/ssl_test_ctx_test.c
rm -f test/ssl_test_ctx_test
${LDCMD:-gcc} -pthread -march=armv7-a -Wa,--noexecstack -Wall -O3 -fPIC -L.  -Wl,-Bsymbolic-functions \
        -o test/ssl_test_ctx_test \
        test/helpers/ssl_test_ctx_test-bin-ssl_test_ctx.o \
        test/ssl_test_ctx_test-bin-ssl_test_ctx_test.o \
        -lssl test/libtestutil.a -lcrypto -ldl -pthread -latomic
gcc  -I. -Iinclude -Iinclude -Iapps/include -I.  -pthread -march=armv7-a -Wa,--noexecstack -Wall -O3 -fPIC -DOPENSSL_BUILDING_OPENSSL -DNDEBUG  -MMD -MF test/helpers/sslapitest-bin-ssltestlib.d.tmp -MT test/helpers/sslapitest-bin-ssltestlib.o -c -o test/helpers/sslapitest-bin-ssltestlib.o test/helpers/ssltestlib.c
gcc  -Iinclude -Iapps/include -I.  -pthread -march=armv7-a -Wa,--noexecstack -Wall -O3 -fPIC -DOPENSSL_BUILDING_OPENSSL -DNDEBUG  -MMD -MF test/sslapitest-bin-filterprov.d.tmp -MT test/sslapitest-bin-filterprov.o -c -o test/sslapitest-bin-filterprov.o test/filterprov.c
gcc  -Iinclude -Iapps/include -I.  -pthread -march=armv7-a -Wa,--noexecstack -Wall -O3 -fPIC -DOPENSSL_BUILDING_OPENSSL -DNDEBUG  -MMD -MF test/sslapitest-bin-sslapitest.d.tmp -MT test/sslapitest-bin-sslapitest.o -c -o test/sslapitest-bin-sslapitest.o test/sslapitest.c
gcc  -Iinclude -Iapps/include -I.  -pthread -march=armv7-a -Wa,--noexecstack -Wall -O3 -fPIC -DOPENSSL_BUILDING_OPENSSL -DNDEBUG  -MMD -MF test/sslapitest-bin-tls-provider.d.tmp -MT test/sslapitest-bin-tls-provider.o -c -o test/sslapitest-bin-tls-provider.o test/tls-provider.c
rm -f test/sslapitest
${LDCMD:-gcc} -pthread -march=armv7-a -Wa,--noexecstack -Wall -O3 -fPIC -L.  -Wl,-Bsymbolic-functions \
        -o test/sslapitest \
        test/helpers/sslapitest-bin-ssltestlib.o \
        test/sslapitest-bin-filterprov.o \
        test/sslapitest-bin-sslapitest.o \
        test/sslapitest-bin-tls-provider.o \
        -lssl test/libtestutil.a -lcrypto -ldl -pthread -latomic
gcc  -I. -Iinclude -Iinclude -Iapps/include  -pthread -march=armv7-a -Wa,--noexecstack -Wall -O3 -fPIC -DOPENSSL_BUILDING_OPENSSL -DNDEBUG  -MMD -MF test/helpers/sslbuffertest-bin-ssltestlib.d.tmp -MT test/helpers/sslbuffertest-bin-ssltestlib.o -c -o test/helpers/sslbuffertest-bin-ssltestlib.o test/helpers/ssltestlib.c
gcc  -Iinclude -Iapps/include  -pthread -march=armv7-a -Wa,--noexecstack -Wall -O3 -fPIC -DOPENSSL_BUILDING_OPENSSL -DNDEBUG  -MMD -MF test/sslbuffertest-bin-sslbuffertest.d.tmp -MT test/sslbuffertest-bin-sslbuffertest.o -c -o test/sslbuffertest-bin-sslbuffertest.o test/sslbuffertest.c
rm -f test/sslbuffertest
${LDCMD:-gcc} -pthread -march=armv7-a -Wa,--noexecstack -Wall -O3 -fPIC -L.  -Wl,-Bsymbolic-functions \
        -o test/sslbuffertest \
        test/helpers/sslbuffertest-bin-ssltestlib.o \
        test/sslbuffertest-bin-sslbuffertest.o \
        -lssl test/libtestutil.a -lcrypto -ldl -pthread -latomic
gcc  -I. -Iinclude -Iinclude -Iapps/include  -pthread -march=armv7-a -Wa,--noexecstack -Wall -O3 -fPIC -DOPENSSL_BUILDING_OPENSSL -DNDEBUG  -MMD -MF test/helpers/sslcorrupttest-bin-ssltestlib.d.tmp -MT test/helpers/sslcorrupttest-bin-ssltestlib.o -c -o test/helpers/sslcorrupttest-bin-ssltestlib.o test/helpers/ssltestlib.c
gcc  -Iinclude -Iapps/include  -pthread -march=armv7-a -Wa,--noexecstack -Wall -O3 -fPIC -DOPENSSL_BUILDING_OPENSSL -DNDEBUG  -MMD -MF test/sslcorrupttest-bin-sslcorrupttest.d.tmp -MT test/sslcorrupttest-bin-sslcorrupttest.o -c -o test/sslcorrupttest-bin-sslcorrupttest.o test/sslcorrupttest.c
rm -f test/sslcorrupttest
${LDCMD:-gcc} -pthread -march=armv7-a -Wa,--noexecstack -Wall -O3 -fPIC -L.  -Wl,-Bsymbolic-functions \
        -o test/sslcorrupttest \
        test/helpers/sslcorrupttest-bin-ssltestlib.o \
        test/sslcorrupttest-bin-sslcorrupttest.o \
        -lssl test/libtestutil.a -lcrypto -ldl -pthread -latomic
gcc  -Iinclude -Iapps/include  -pthread -march=armv7-a -Wa,--noexecstack -Wall -O3 -fPIC -DOPENSSL_BUILDING_OPENSSL -DNDEBUG  -MMD -MF test/stack_test-bin-stack_test.d.tmp -MT test/stack_test-bin-stack_test.o -c -o test/stack_test-bin-stack_test.o test/stack_test.c
rm -f test/stack_test
${LDCMD:-gcc} -pthread -march=armv7-a -Wa,--noexecstack -Wall -O3 -fPIC -L.  -Wl,-Bsymbolic-functions \
        -o test/stack_test \
        test/stack_test-bin-stack_test.o \
        test/libtestutil.a -lcrypto -ldl -pthread -latomic
gcc  -Iinclude -Iapps/include  -pthread -march=armv7-a -Wa,--noexecstack -Wall -O3 -fPIC -DOPENSSL_BUILDING_OPENSSL -DNDEBUG  -MMD -MF test/sysdefaulttest-bin-sysdefaulttest.d.tmp -MT test/sysdefaulttest-bin-sysdefaulttest.o -c -o test/sysdefaulttest-bin-sysdefaulttest.o test/sysdefaulttest.c
rm -f test/sysdefaulttest
${LDCMD:-gcc} -pthread -march=armv7-a -Wa,--noexecstack -Wall -O3 -fPIC -L.  -Wl,-Bsymbolic-functions \
        -o test/sysdefaulttest \
        test/sysdefaulttest-bin-sysdefaulttest.o \
        -lssl test/libtestutil.a -lcrypto -ldl -pthread -latomic
gcc  -Iinclude -Iapps/include  -pthread -march=armv7-a -Wa,--noexecstack -Wall -O3 -fPIC -DOPENSSL_BUILDING_OPENSSL -DNDEBUG  -MMD -MF test/test_test-bin-test_test.d.tmp -MT test/test_test-bin-test_test.o -c -o test/test_test-bin-test_test.o test/test_test.c
rm -f test/test_test
${LDCMD:-gcc} -pthread -march=armv7-a -Wa,--noexecstack -Wall -O3 -fPIC -L.  -Wl,-Bsymbolic-functions \
        -o test/test_test \
        test/test_test-bin-test_test.o \
        test/libtestutil.a -lcrypto -ldl -pthread -latomic
gcc  -Iinclude -Iapps/include  -pthread -march=armv7-a -Wa,--noexecstack -Wall -O3 -fPIC -DOPENSSL_BUILDING_OPENSSL -DNDEBUG  -MMD -MF test/threadstest-bin-threadstest.d.tmp -MT test/threadstest-bin-threadstest.o -c -o test/threadstest-bin-threadstest.o test/threadstest.c
rm -f test/threadstest
${LDCMD:-gcc} -pthread -march=armv7-a -Wa,--noexecstack -Wall -O3 -fPIC -L.  -Wl,-Bsymbolic-functions \
        -o test/threadstest \
        test/threadstest-bin-threadstest.o \
        test/libtestutil.a -lcrypto -ldl -pthread -latomic
gcc  -Iinclude -Iapps/include  -pthread -march=armv7-a -Wa,--noexecstack -Wall -O3 -fPIC -DOPENSSL_BUILDING_OPENSSL -DNDEBUG  -MMD -MF test/threadstest_fips-bin-threadstest_fips.d.tmp -MT test/threadstest_fips-bin-threadstest_fips.o -c -o test/threadstest_fips-bin-threadstest_fips.o test/threadstest_fips.c
rm -f test/threadstest_fips
${LDCMD:-gcc} -pthread -march=armv7-a -Wa,--noexecstack -Wall -O3 -fPIC -L.  -Wl,-Bsymbolic-functions \
        -o test/threadstest_fips \
        test/threadstest_fips-bin-threadstest_fips.o \
        test/libtestutil.a -lcrypto -ldl -pthread -latomic
gcc  -Iinclude -Iapps/include  -pthread -march=armv7-a -Wa,--noexecstack -Wall -O3 -fPIC -DOPENSSL_BUILDING_OPENSSL -DNDEBUG  -MMD -MF test/time_offset_test-bin-time_offset_test.d.tmp -MT test/time_offset_test-bin-time_offset_test.o -c -o test/time_offset_test-bin-time_offset_test.o test/time_offset_test.c
rm -f test/time_offset_test
${LDCMD:-gcc} -pthread -march=armv7-a -Wa,--noexecstack -Wall -O3 -fPIC -L.  -Wl,-Bsymbolic-functions \
        -o test/time_offset_test \
        test/time_offset_test-bin-time_offset_test.o \
        test/libtestutil.a -lcrypto -ldl -pthread -latomic
gcc  -I. -Iinclude -Iinclude -Iapps/include  -pthread -march=armv7-a -Wa,--noexecstack -Wall -O3 -fPIC -DOPENSSL_BUILDING_OPENSSL -DNDEBUG  -MMD -MF test/helpers/tls13ccstest-bin-ssltestlib.d.tmp -MT test/helpers/tls13ccstest-bin-ssltestlib.o -c -o test/helpers/tls13ccstest-bin-ssltestlib.o test/helpers/ssltestlib.c
gcc  -Iinclude -Iapps/include  -pthread -march=armv7-a -Wa,--noexecstack -Wall -O3 -fPIC -DOPENSSL_BUILDING_OPENSSL -DNDEBUG  -MMD -MF test/tls13ccstest-bin-tls13ccstest.d.tmp -MT test/tls13ccstest-bin-tls13ccstest.o -c -o test/tls13ccstest-bin-tls13ccstest.o test/tls13ccstest.c
rm -f test/tls13ccstest
${LDCMD:-gcc} -pthread -march=armv7-a -Wa,--noexecstack -Wall -O3 -fPIC -L.  -Wl,-Bsymbolic-functions \
        -o test/tls13ccstest \
        test/helpers/tls13ccstest-bin-ssltestlib.o \
        test/tls13ccstest-bin-tls13ccstest.o \
        -lssl test/libtestutil.a -lcrypto -ldl -pthread -latomic
gcc  -I. -Iinclude -Iapps/include  -pthread -march=armv7-a -Wa,--noexecstack -Wall -O3 -fPIC -DOPENSSL_BUILDING_OPENSSL -DNDEBUG  -MMD -MF test/tls13encryptiontest-bin-tls13encryptiontest.d.tmp -MT test/tls13encryptiontest-bin-tls13encryptiontest.o -c -o test/tls13encryptiontest-bin-tls13encryptiontest.o test/tls13encryptiontest.c
rm -f test/tls13encryptiontest
${LDCMD:-gcc} -pthread -march=armv7-a -Wa,--noexecstack -Wall -O3 -fPIC  -Wl,-Bsymbolic-functions \
        -o test/tls13encryptiontest \
        test/tls13encryptiontest-bin-tls13encryptiontest.o \
        libssl.a test/libtestutil.a libcrypto.a -ldl -pthread -latomic
gcc  -I. -Iinclude -Iapps/include  -DOPENSSL_NO_KTLS -pthread -march=armv7-a -Wa,--noexecstack -Wall -O3 -fPIC -DOPENSSL_BUILDING_OPENSSL -DNDEBUG  -MMD -MF crypto/tls13secretstest-bin-packet.d.tmp -MT crypto/tls13secretstest-bin-packet.o -c -o crypto/tls13secretstest-bin-packet.o crypto/packet.c
gcc  -I. -Iinclude -Iapps/include  -DOPENSSL_NO_KTLS -pthread -march=armv7-a -Wa,--noexecstack -Wall -O3 -fPIC -DOPENSSL_BUILDING_OPENSSL -DNDEBUG  -MMD -MF ssl/tls13secretstest-bin-tls13_enc.d.tmp -MT ssl/tls13secretstest-bin-tls13_enc.o -c -o ssl/tls13secretstest-bin-tls13_enc.o ssl/tls13_enc.c
gcc  -I. -Iinclude -Iapps/include  -DOPENSSL_NO_KTLS -pthread -march=armv7-a -Wa,--noexecstack -Wall -O3 -fPIC -DOPENSSL_BUILDING_OPENSSL -DNDEBUG  -MMD -MF test/tls13secretstest-bin-tls13secretstest.d.tmp -MT test/tls13secretstest-bin-tls13secretstest.o -c -o test/tls13secretstest-bin-tls13secretstest.o test/tls13secretstest.c
rm -f test/tls13secretstest
${LDCMD:-gcc} -pthread -march=armv7-a -Wa,--noexecstack -Wall -O3 -fPIC -L.  -Wl,-Bsymbolic-functions \
        -o test/tls13secretstest \
        crypto/tls13secretstest-bin-packet.o \
        ssl/tls13secretstest-bin-tls13_enc.o \
        test/tls13secretstest-bin-tls13secretstest.o \
        -lssl test/libtestutil.a -lcrypto -ldl -pthread -latomic
gcc  -I. -Iinclude -Iapps/include  -pthread -march=armv7-a -Wa,--noexecstack -Wall -O3 -fPIC -DOPENSSL_BUILDING_OPENSSL -DNDEBUG  -MMD -MF apps/lib/uitest-bin-apps_ui.d.tmp -MT apps/lib/uitest-bin-apps_ui.o -c -o apps/lib/uitest-bin-apps_ui.o apps/lib/apps_ui.c
gcc  -I. -Iinclude -Iapps/include  -pthread -march=armv7-a -Wa,--noexecstack -Wall -O3 -fPIC -DOPENSSL_BUILDING_OPENSSL -DNDEBUG  -MMD -MF test/uitest-bin-uitest.d.tmp -MT test/uitest-bin-uitest.o -c -o test/uitest-bin-uitest.o test/uitest.c
rm -f test/uitest
${LDCMD:-gcc} -pthread -march=armv7-a -Wa,--noexecstack -Wall -O3 -fPIC -L.  -Wl,-Bsymbolic-functions \
        -o test/uitest \
        apps/lib/uitest-bin-apps_ui.o test/uitest-bin-uitest.o \
        -lssl test/libtestutil.a -lcrypto -ldl -pthread -latomic
gcc  -Iinclude -Iapps/include  -pthread -march=armv7-a -Wa,--noexecstack -Wall -O3 -fPIC -DOPENSSL_BUILDING_OPENSSL -DNDEBUG  -MMD -MF test/upcallstest-bin-upcallstest.d.tmp -MT test/upcallstest-bin-upcallstest.o -c -o test/upcallstest-bin-upcallstest.o test/upcallstest.c
rm -f test/upcallstest
${LDCMD:-gcc} -pthread -march=armv7-a -Wa,--noexecstack -Wall -O3 -fPIC -L.  -Wl,-Bsymbolic-functions \
        -o test/upcallstest \
        test/upcallstest-bin-upcallstest.o \
        test/libtestutil.a -lcrypto -ldl -pthread -latomic
gcc  -Iinclude -Iapps/include  -pthread -march=armv7-a -Wa,--noexecstack -Wall -O3 -fPIC -DOPENSSL_BUILDING_OPENSSL -DNDEBUG  -MMD -MF test/user_property_test-bin-user_property_test.d.tmp -MT test/user_property_test-bin-user_property_test.o -c -o test/user_property_test-bin-user_property_test.o test/user_property_test.c
rm -f test/user_property_test
${LDCMD:-gcc} -pthread -march=armv7-a -Wa,--noexecstack -Wall -O3 -fPIC -L.  -Wl,-Bsymbolic-functions \
        -o test/user_property_test \
        test/user_property_test-bin-user_property_test.o \
        test/libtestutil.a -lcrypto -ldl -pthread -latomic
gcc  -Iinclude -Iapps/include  -pthread -march=armv7-a -Wa,--noexecstack -Wall -O3 -fPIC -DOPENSSL_BUILDING_OPENSSL -DNDEBUG  -MMD -MF test/v3ext-bin-v3ext.d.tmp -MT test/v3ext-bin-v3ext.o -c -o test/v3ext-bin-v3ext.o test/v3ext.c
rm -f test/v3ext
${LDCMD:-gcc} -pthread -march=armv7-a -Wa,--noexecstack -Wall -O3 -fPIC -L.  -Wl,-Bsymbolic-functions \
        -o test/v3ext \
        test/v3ext-bin-v3ext.o \
        test/libtestutil.a -lcrypto -ldl -pthread -latomic
gcc  -Iinclude -Iapps/include  -pthread -march=armv7-a -Wa,--noexecstack -Wall -O3 -fPIC -DOPENSSL_BUILDING_OPENSSL -DNDEBUG  -MMD -MF test/v3nametest-bin-v3nametest.d.tmp -MT test/v3nametest-bin-v3nametest.o -c -o test/v3nametest-bin-v3nametest.o test/v3nametest.c
rm -f test/v3nametest
${LDCMD:-gcc} -pthread -march=armv7-a -Wa,--noexecstack -Wall -O3 -fPIC -L.  -Wl,-Bsymbolic-functions \
        -o test/v3nametest \
        test/v3nametest-bin-v3nametest.o \
        test/libtestutil.a -lcrypto -ldl -pthread -latomic
gcc  -Iinclude -Iapps/include  -pthread -march=armv7-a -Wa,--noexecstack -Wall -O3 -fPIC -DOPENSSL_BUILDING_OPENSSL -DNDEBUG  -MMD -MF test/verify_extra_test-bin-verify_extra_test.d.tmp -MT test/verify_extra_test-bin-verify_extra_test.o -c -o test/verify_extra_test-bin-verify_extra_test.o test/verify_extra_test.c
rm -f test/verify_extra_test
${LDCMD:-gcc} -pthread -march=armv7-a -Wa,--noexecstack -Wall -O3 -fPIC -L.  -Wl,-Bsymbolic-functions \
        -o test/verify_extra_test \
        test/verify_extra_test-bin-verify_extra_test.o \
        test/libtestutil.a -lcrypto -ldl -pthread -latomic
gcc  -Iinclude -Iapps/include  -pthread -march=armv7-a -Wa,--noexecstack -Wall -O3 -fPIC -DOPENSSL_BUILDING_OPENSSL -DNDEBUG  -MMD -MF test/versions-bin-versions.d.tmp -MT test/versions-bin-versions.o -c -o test/versions-bin-versions.o test/versions.c
rm -f test/versions
${LDCMD:-gcc} -pthread -march=armv7-a -Wa,--noexecstack -Wall -O3 -fPIC -L.  -Wl,-Bsymbolic-functions \
        -o test/versions \
        test/versions-bin-versions.o \
        -lcrypto -ldl -pthread -latomic
gcc  -Iinclude -Iapps/include  -pthread -march=armv7-a -Wa,--noexecstack -Wall -O3 -fPIC -DOPENSSL_BUILDING_OPENSSL -DNDEBUG  -MMD -MF test/wpackettest-bin-wpackettest.d.tmp -MT test/wpackettest-bin-wpackettest.o -c -o test/wpackettest-bin-wpackettest.o test/wpackettest.c
rm -f test/wpackettest
${LDCMD:-gcc} -pthread -march=armv7-a -Wa,--noexecstack -Wall -O3 -fPIC  -Wl,-Bsymbolic-functions \
        -o test/wpackettest \
        test/wpackettest-bin-wpackettest.o \
        libssl.a test/libtestutil.a libcrypto.a -ldl -pthread -latomic
gcc  -Iinclude -Iapps/include  -pthread -march=armv7-a -Wa,--noexecstack -Wall -O3 -fPIC -DOPENSSL_BUILDING_OPENSSL -DNDEBUG  -MMD -MF test/x509_check_cert_pkey_test-bin-x509_check_cert_pkey_test.d.tmp -MT test/x509_check_cert_pkey_test-bin-x509_check_cert_pkey_test.o -c -o test/x509_check_cert_pkey_test-bin-x509_check_cert_pkey_test.o test/x509_check_cert_pkey_test.c
rm -f test/x509_check_cert_pkey_test
${LDCMD:-gcc} -pthread -march=armv7-a -Wa,--noexecstack -Wall -O3 -fPIC -L.  -Wl,-Bsymbolic-functions \
        -o test/x509_check_cert_pkey_test \
        test/x509_check_cert_pkey_test-bin-x509_check_cert_pkey_test.o \
        test/libtestutil.a -lcrypto -ldl -pthread -latomic
gcc  -Iinclude -Iapps/include  -pthread -march=armv7-a -Wa,--noexecstack -Wall -O3 -fPIC -DOPENSSL_BUILDING_OPENSSL -DNDEBUG  -MMD -MF test/x509_dup_cert_test-bin-x509_dup_cert_test.d.tmp -MT test/x509_dup_cert_test-bin-x509_dup_cert_test.o -c -o test/x509_dup_cert_test-bin-x509_dup_cert_test.o test/x509_dup_cert_test.c
rm -f test/x509_dup_cert_test
${LDCMD:-gcc} -pthread -march=armv7-a -Wa,--noexecstack -Wall -O3 -fPIC -L.  -Wl,-Bsymbolic-functions \
        -o test/x509_dup_cert_test \
        test/x509_dup_cert_test-bin-x509_dup_cert_test.o \
        test/libtestutil.a -lcrypto -ldl -pthread -latomic
gcc  -I. -Iinclude -Iapps/include  -pthread -march=armv7-a -Wa,--noexecstack -Wall -O3 -fPIC -DOPENSSL_BUILDING_OPENSSL -DNDEBUG  -MMD -MF test/x509_internal_test-bin-x509_internal_test.d.tmp -MT test/x509_internal_test-bin-x509_internal_test.o -c -o test/x509_internal_test-bin-x509_internal_test.o test/x509_internal_test.c
rm -f test/x509_internal_test
${LDCMD:-gcc} -pthread -march=armv7-a -Wa,--noexecstack -Wall -O3 -fPIC  -Wl,-Bsymbolic-functions \
        -o test/x509_internal_test \
        test/x509_internal_test-bin-x509_internal_test.o \
        test/libtestutil.a libcrypto.a -ldl -pthread -latomic
gcc  -Iinclude -Iapps/include  -pthread -march=armv7-a -Wa,--noexecstack -Wall -O3 -fPIC -DOPENSSL_BUILDING_OPENSSL -DNDEBUG  -MMD -MF test/x509_time_test-bin-x509_time_test.d.tmp -MT test/x509_time_test-bin-x509_time_test.o -c -o test/x509_time_test-bin-x509_time_test.o test/x509_time_test.c
rm -f test/x509_time_test
${LDCMD:-gcc} -pthread -march=armv7-a -Wa,--noexecstack -Wall -O3 -fPIC -L.  -Wl,-Bsymbolic-functions \
        -o test/x509_time_test \
        test/x509_time_test-bin-x509_time_test.o \
        test/libtestutil.a -lcrypto -ldl -pthread -latomic
gcc  -Iinclude -Iapps/include  -pthread -march=armv7-a -Wa,--noexecstack -Wall -O3 -fPIC -DOPENSSL_BUILDING_OPENSSL -DNDEBUG  -MMD -MF test/x509aux-bin-x509aux.d.tmp -MT test/x509aux-bin-x509aux.o -c -o test/x509aux-bin-x509aux.o test/x509aux.c
rm -f test/x509aux
${LDCMD:-gcc} -pthread -march=armv7-a -Wa,--noexecstack -Wall -O3 -fPIC -L.  -Wl,-Bsymbolic-functions \
        -o test/x509aux \
        test/x509aux-bin-x509aux.o \
        test/libtestutil.a -lcrypto -ldl -pthread -latomic
rm -f "apps/CA.pl"
/usr/bin/perl "-I." -Mconfigdata "util/dofile.pl" \
    "-oMakefile" apps/CA.pl.in > "apps/CA.pl"
chmod a+x apps/CA.pl
rm -f "apps/tsget.pl"
/usr/bin/perl "-I." -Mconfigdata "util/dofile.pl" \
    "-oMakefile" apps/tsget.in > "apps/tsget.pl"
chmod a+x apps/tsget.pl
rm -f "tools/c_rehash"
/usr/bin/perl "-I." -Mconfigdata "util/dofile.pl" \
    "-oMakefile" tools/c_rehash.in > "tools/c_rehash"
chmod a+x tools/c_rehash
rm -f "util/shlib_wrap.sh"
/usr/bin/perl "-I." -Mconfigdata "util/dofile.pl" \
    "-oMakefile" util/shlib_wrap.sh.in > "util/shlib_wrap.sh"
chmod a+x util/shlib_wrap.sh
rm -f "util/wrap.pl"
/usr/bin/perl "-I." -Mconfigdata "util/dofile.pl" \
    "-oMakefile" util/wrap.pl.in > "util/wrap.pl"
chmod a+x util/wrap.pl
make[1]: Leaving directory '/root/python3/openssl-3.0.0'
root@bunny:~/python3/openssl-3.0.0# make test
make depend && make _tests
make[1]: Entering directory '/root/python3/openssl-3.0.0'
make[1]: Leaving directory '/root/python3/openssl-3.0.0'
make[1]: Entering directory '/root/python3/openssl-3.0.0'
( SRCTOP=. \
  BLDTOP=. \
  PERL="/usr/bin/perl" \
  FIPSKEY="f4556650ac31d35461610bac4ed81b1a181b2d8a43ea2854cbae22ca74560813" \
  EXE_EXT= \
  /usr/bin/perl ./test/run_tests.pl  )
00-prep_fipsmodule_cnf.t .. skipped: FIPS module config file only supported in a fips build
Files=1, Tests=0,  3 wallclock secs ( 0.12 usr  0.01 sys +  2.51 cusr  0.10 csys =  2.74 CPU)
Result: NOTESTS
01-test_abort.t .................... ok
01-test_fipsmodule_cnf.t ........... skipped: Test only supported in a fips build
01-test_sanity.t ................... ok
01-test_symbol_presence.t .......... ok
01-test_test.t ..................... ok
02-test_errstr.t ................... ok
02-test_internal_context.t ......... ok
02-test_internal_ctype.t ........... ok
02-test_internal_keymgmt.t ......... ok
02-test_internal_provider.t ........ ok
02-test_lhash.t .................... ok
02-test_ordinals.t ................. ok
02-test_sparse_array.t ............. ok
02-test_stack.t .................... ok
03-test_exdata.t ................... ok
03-test_fipsinstall.t .............. skipped: Test only supported in a fips build
03-test_internal_asn1.t ............ ok
03-test_internal_asn1_dsa.t ........ ok
03-test_internal_bn.t .............. ok
03-test_internal_chacha.t .......... ok
03-test_internal_curve448.t ........ ok
03-test_internal_ec.t .............. ok
03-test_internal_ffc.t ............. ok
03-test_internal_mdc2.t ............ ok
03-test_internal_modes.t ........... ok
03-test_internal_namemap.t ......... ok
03-test_internal_poly1305.t ........ ok
03-test_internal_rsa_sp800_56b.t ... ok
03-test_internal_siphash.t ......... ok
03-test_internal_sm2.t ............. ok
03-test_internal_sm3.t ............. ok
03-test_internal_sm4.t ............. ok
03-test_internal_ssl_cert_table.t .. ok
03-test_internal_x509.t ............ ok
03-test_params_api.t ............... ok
03-test_property.t ................. ok
03-test_ui.t ....................... ok
04-test_asn1_decode.t .............. ok
04-test_asn1_encode.t .............. ok
04-test_asn1_string_table.t ........ ok
04-test_bio_callback.t ............. ok
04-test_bio_core.t ................. ok
04-test_bioprint.t ................. ok
04-test_conf.t ..................... ok
04-test_encoder_decoder.t .......... ok
04-test_encoder_decoder_legacy.t ... ok
04-test_err.t ...................... ok
04-test_hexstring.t ................ ok
04-test_param_build.t .............. ok
04-test_params.t ................... ok
04-test_params_conversion.t ........ ok
04-test_pem_read_depr.t ............ ok
04-test_pem_reading.t .............. ok
04-test_provfetch.t ................ ok
04-test_provider.t ................. ok
04-test_provider_fallback.t ........ ok
04-test_upcalls.t .................. ok
05-test_bf.t ....................... ok
05-test_cast.t ..................... ok
05-test_cmac.t ..................... ok
05-test_des.t ...................... ok
05-test_hmac.t ..................... ok
05-test_idea.t ..................... ok
05-test_pbe.t ...................... ok
05-test_rand.t ..................... ok
05-test_rc2.t ...................... ok
05-test_rc4.t ...................... ok
05-test_rc5.t ...................... skipped: rc5 is not supported by this OpenSSL build
06-test_algorithmid.t .............. ok
06-test_rdrand_sanity.t ............ ok
10-test_bn.t ....................... ok
10-test_exp.t ...................... ok
15-test_dh.t ....................... ok
15-test_dsa.t ...................... ok
15-test_dsaparam.t ................. ok
15-test_ec.t ....................... ok
15-test_ecdsa.t .................... ok
15-test_ecparam.t .................. ok
15-test_gendh.t .................... ok
15-test_gendhparam.t ............... ok
15-test_gendsa.t ................... ok
15-test_genec.t .................... ok
15-test_genrsa.t ................... ok
15-test_mp_rsa.t ................... ok
15-test_out_option.t ............... ok
15-test_rsa.t ...................... ok
15-test_rsaoaep.t .................. ok
15-test_rsapss.t ................... ok
15-test_sha.t ...................... ok
20-test_app.t ...................... ok
20-test_cli_fips.t ................. skipped: Test only supported in a fips build with security checks
20-test_dgst.t ..................... ok
20-test_dhparam.t .................. ok
20-test_dhparam_check.t ............ ok
20-test_enc.t ...................... ok
20-test_enc_more.t ................. ok
20-test_kdf.t ...................... ok
20-test_mac.t ...................... ok
20-test_passwd.t ................... ok
20-test_pkeyutl.t .................. ok
20-test_rand_config.t .............. ok
20-test_spkac.t .................... ok
25-test_crl.t ...................... ok
25-test_d2i.t ...................... ok
25-test_eai_data.t ................. ok
25-test_pkcs7.t .................... ok
25-test_req.t ...................... ok
25-test_rusext.t ................... ok
25-test_sid.t ...................... ok
25-test_verify.t ................... 154/?
C = CN, ST = LN, L = Shenyang, O = Test Org, OU = Test OU, CN = Test SM2 CA
error 10 at 1 depth lookup: certificate has expired
C = CN, ST = LN, L = Shenyang, O = Test Org, OU = Test OU, CN = Test SM2 Sign Cert
error 10 at 0 depth lookup: certificate has expired
error ../../test/certs/sm2.pem: verification failed
../../util/wrap.pl ../../apps/openssl verify -auth_level 1 -vfyopt 'distid:1234567812345678' -trusted ../../test/certs/sm2-ca-cert.pem ../../test/certs/sm2.pem => 2
not ok 156 - SM2 ID test
# ------------------------------------------------------------------------------
#   Failed test 'SM2 ID test'
#   at /root/python3/openssl-3.0.0/util/perl/OpenSSL/Test.pm line 882.
C = CN, ST = LN, L = Shenyang, O = Test Org, OU = Test OU, CN = Test SM2 CA
error 10 at 1 depth lookup: certificate has expired
C = CN, ST = LN, L = Shenyang, O = Test Org, OU = Test OU, CN = Test SM2 Sign Cert
error 10 at 0 depth lookup: certificate has expired
error ../../test/certs/sm2.pem: verification failed
../../util/wrap.pl ../../apps/openssl verify -auth_level 1 -vfyopt 'hexdistid:31323334353637383132333435363738' -trusted ../../test/certs/sm2-ca-cert.pem ../../test/certs/sm2.pem => 2
not ok 157 - SM2 hex ID test
25-test_verify.t ................... 159/? -------------------------------------
25-test_verify.t ................... Dubious, test returned 2 (wstat 512, 0x200)
Failed 2/159 subtests
25-test_verify_store.t ............. ok
25-test_x509.t ..................... ok
30-test_acvp.t ..................... skipped: ACVP is not supported by this test
30-test_aesgcm.t ................... ok
30-test_afalg.t .................... skipped: test_afalg not supported for this build
30-test_defltfips.t ................ ok
30-test_engine.t ................... ok
30-test_evp.t ...................... ok
30-test_evp_extra.t ................ ok
30-test_evp_fetch_prov.t ........... ok
30-test_evp_kdf.t .................. ok
30-test_evp_libctx.t ............... ok
30-test_evp_pkey_dparam.t .......... ok
30-test_evp_pkey_provided.t ........ ok
30-test_pbelu.t .................... ok
30-test_pkey_meth.t ................ ok
30-test_pkey_meth_kdf.t ............ ok
30-test_prov_config.t .............. ok
30-test_provider_status.t .......... ok
40-test_rehash.t ................... ok
60-test_x509_check_cert_pkey.t ..... ok
60-test_x509_dup_cert.t ............ ok
60-test_x509_store.t ............... ok
60-test_x509_time.t ................ ok
61-test_bio_prefix.t ............... ok
61-test_bio_readbuffer.t ........... ok
65-test_cmp_asn.t .................. ok
65-test_cmp_client.t ............... ok
65-test_cmp_ctx.t .................. ok
65-test_cmp_hdr.t .................. ok
65-test_cmp_msg.t .................. ok
65-test_cmp_protect.t .............. ok
65-test_cmp_server.t ............... ok
65-test_cmp_status.t ............... ok
65-test_cmp_vfy.t .................. ok
66-test_ossl_store.t ............... ok
70-test_asyncio.t .................. ok
70-test_bad_dtls.t ................. ok
70-test_clienthello.t .............. ok
70-test_comp.t ..................... ok
70-test_key_share.t ................ ok
70-test_packet.t ................... ok
70-test_recordlen.t ................ ok
70-test_renegotiation.t ............ ok
70-test_servername.t ............... ok
70-test_sslcbcpadding.t ............ ok
70-test_sslcertstatus.t ............ ok
70-test_sslextension.t ............. ok
70-test_sslmessages.t .............. ok
70-test_sslrecords.t ............... ok
70-test_sslsessiontick.t ........... ok
70-test_sslsigalgs.t ............... ok
70-test_sslsignature.t ............. ok
70-test_sslskewith0p.t ............. ok
70-test_sslversions.t .............. ok
70-test_sslvertol.t ................ ok
70-test_tls13alerts.t .............. ok
70-test_tls13cookie.t .............. ok
70-test_tls13downgrade.t ........... ok
70-test_tls13hrr.t ................. ok
70-test_tls13kexmodes.t ............ ok
70-test_tls13messages.t ............ ok
70-test_tls13psk.t ................. ok
70-test_tlsextms.t ................. ok
70-test_verify_extra.t ............. ok
70-test_wpacket.t .................. ok
71-test_ssl_ctx.t .................. ok
79-test_http.t ..................... ok
80-test_ca.t ....................... ok
80-test_cipherbytes.t .............. ok
80-test_cipherlist.t ............... ok
80-test_ciphername.t ............... ok
80-test_cmp_http.t ................. 5/?
#
80-test_cmp_http.t ................. ok
80-test_cms.t ...................... 1/?
    # CMD: openssl cms -provider-path ../../providers -provider default -sign -in ../../test/smcont.txt -outform DER -nodetach -certfile ../../test/smime-certs/smroot.pem -signer ../../test/smime-certs/smrsa1.pem -out cms2pkcs7-1.cms
../../util/wrap.pl ../../apps/openssl cms -provider-path ../../providers -provider default -sign -in ../../test/smcont.txt -outform DER -nodetach -certfile ../../test/smime-certs/smroot.pem -signer ../../test/smime-certs/smrsa1.pem -out cms2pkcs7-1.cms => 0
    # CMD: openssl smime -provider-path ../../providers -provider default -verify -in cms2pkcs7-1.cms -inform DER -CAfile ../../test/smime-certs/smroot.pem -out cms2pkcs7-1.txt
Verification failure
0000FCB6:error:10800075:PKCS7 routines:(unknown function):certificate verify error:crypto/pkcs7/pk7_smime.c:293:Verify error: certificate has expired
../../util/wrap.pl ../../apps/openssl smime -provider-path ../../providers -provider default -verify -in cms2pkcs7-1.cms -inform DER -CAfile ../../test/smime-certs/smroot.pem -out cms2pkcs7-1.txt => 4
    not ok 1 - signed content DER format, RSA key
# ------------------------------------------------------------------------------

    #   Failed test 'signed content DER format, RSA key'
    #   at test/recipes/80-test_cms.t line 668.
    # CMD: openssl cms -provider-path ../../providers -provider default -sign -in ../../test/smcont.txt -outform DER -signer ../../test/smime-certs/smrsa1.pem -out cms2pkcs7-2.cms
../../util/wrap.pl ../../apps/openssl cms -provider-path ../../providers -provider default -sign -in ../../test/smcont.txt -outform DER -signer ../../test/smime-certs/smrsa1.pem -out cms2pkcs7-2.cms => 0
    # CMD: openssl smime -provider-path ../../providers -provider default -verify -in cms2pkcs7-2.cms -inform DER -CAfile ../../test/smime-certs/smroot.pem -out cms2pkcs7-2.txt -content ../../test/smcont.txt
Verification failure
0080F0B6:error:10800075:PKCS7 routines:(unknown function):certificate verify error:crypto/pkcs7/pk7_smime.c:293:Verify error: certificate has expired
../../util/wrap.pl ../../apps/openssl smime -provider-path ../../providers -provider default -verify -in cms2pkcs7-2.cms -inform DER -CAfile ../../test/smime-certs/smroot.pem -out cms2pkcs7-2.txt -content ../../test/smcont.txt => 4
    not ok 2 - signed detached content DER format, RSA key
# ------------------------------------------------------------------------------

    #   Failed test 'signed detached content DER format, RSA key'
    #   at test/recipes/80-test_cms.t line 668.
    # CMD: openssl cms -provider-path ../../providers -provider default -sign -in ../../test/smcont.txt -outform DER -nodetach -stream -signer ../../test/smime-certs/smrsa1.pem -out cms2pkcs7-3.cms
../../util/wrap.pl ../../apps/openssl cms -provider-path ../../providers -provider default -sign -in ../../test/smcont.txt -outform DER -nodetach -stream -signer ../../test/smime-certs/smrsa1.pem -out cms2pkcs7-3.cms => 0
    # CMD: openssl smime -provider-path ../../providers -provider default -verify -in cms2pkcs7-3.cms -inform DER -CAfile ../../test/smime-certs/smroot.pem -out cms2pkcs7-3.txt
Verification failure
00F0FEB6:error:10800075:PKCS7 routines:(unknown function):certificate verify error:crypto/pkcs7/pk7_smime.c:293:Verify error: certificate has expired
../../util/wrap.pl ../../apps/openssl smime -provider-path ../../providers -provider default -verify -in cms2pkcs7-3.cms -inform DER -CAfile ../../test/smime-certs/smroot.pem -out cms2pkcs7-3.txt => 4
    not ok 3 - signed content test streaming BER format, RSA
# ------------------------------------------------------------------------------

    #   Failed test 'signed content test streaming BER format, RSA'
    #   at test/recipes/80-test_cms.t line 668.
    # CMD: openssl cms -provider-path ../../providers -provider default -sign -in ../../test/smcont.txt -outform DER -nodetach -signer ../../test/smime-certs/smdsa1.pem -out cms2pkcs7-4.cms
../../util/wrap.pl ../../apps/openssl cms -provider-path ../../providers -provider default -sign -in ../../test/smcont.txt -outform DER -nodetach -signer ../../test/smime-certs/smdsa1.pem -out cms2pkcs7-4.cms => 0
    # CMD: openssl smime -provider-path ../../providers -provider default -verify -in cms2pkcs7-4.cms -inform DER -CAfile ../../test/smime-certs/smroot.pem -out cms2pkcs7-4.txt
Verification failure
0000FCB6:error:10800075:PKCS7 routines:(unknown function):certificate verify error:crypto/pkcs7/pk7_smime.c:293:Verify error: certificate has expired
../../util/wrap.pl ../../apps/openssl smime -provider-path ../../providers -provider default -verify -in cms2pkcs7-4.cms -inform DER -CAfile ../../test/smime-certs/smroot.pem -out cms2pkcs7-4.txt => 4
    not ok 4 - signed content DER format, DSA key
# ------------------------------------------------------------------------------

    #   Failed test 'signed content DER format, DSA key'
    #   at test/recipes/80-test_cms.t line 668.
    # CMD: openssl cms -provider-path ../../providers -provider default -sign -in ../../test/smcont.txt -outform DER -signer ../../test/smime-certs/smdsa1.pem -out cms2pkcs7-5.cms
../../util/wrap.pl ../../apps/openssl cms -provider-path ../../providers -provider default -sign -in ../../test/smcont.txt -outform DER -signer ../../test/smime-certs/smdsa1.pem -out cms2pkcs7-5.cms => 0
    # CMD: openssl smime -provider-path ../../providers -provider default -verify -in cms2pkcs7-5.cms -inform DER -CAfile ../../test/smime-certs/smroot.pem -out cms2pkcs7-5.txt -content ../../test/smcont.txt
Verification failure
00C0FEB6:error:10800075:PKCS7 routines:(unknown function):certificate verify error:crypto/pkcs7/pk7_smime.c:293:Verify error: certificate has expired
../../util/wrap.pl ../../apps/openssl smime -provider-path ../../providers -provider default -verify -in cms2pkcs7-5.cms -inform DER -CAfile ../../test/smime-certs/smroot.pem -out cms2pkcs7-5.txt -content ../../test/smcont.txt => 4
    not ok 5 - signed detached content DER format, DSA key
# ------------------------------------------------------------------------------

    #   Failed test 'signed detached content DER format, DSA key'
    #   at test/recipes/80-test_cms.t line 668.
    # CMD: openssl cms -provider-path ../../providers -provider default -sign -in ../../test/smcont.txt -outform DER -signer ../../test/smime-certs/smdsa1.pem -out cms2pkcs7-6.cms
../../util/wrap.pl ../../apps/openssl cms -provider-path ../../providers -provider default -sign -in ../../test/smcont.txt -outform DER -signer ../../test/smime-certs/smdsa1.pem -out cms2pkcs7-6.cms => 0
    # CMD: openssl cms -provider-path ../../providers -provider default -resign -in cms2pkcs7-6.cms -inform DER -outform DER -signer ../../test/smime-certs/smrsa1.pem -out cms2pkcs7-62.cms
../../util/wrap.pl ../../apps/openssl cms -provider-path ../../providers -provider default -resign -in cms2pkcs7-6.cms -inform DER -outform DER -signer ../../test/smime-certs/smrsa1.pem -out cms2pkcs7-62.cms => 0
    # CMD: openssl smime -provider-path ../../providers -provider default -verify -in cms2pkcs7-62.cms -inform DER -CAfile ../../test/smime-certs/smroot.pem -out cms2pkcs7-6.txt -content ../../test/smcont.txt
Verification failure
0090FDB6:error:10800075:PKCS7 routines:(unknown function):certificate verify error:crypto/pkcs7/pk7_smime.c:293:Verify error: certificate has expired
../../util/wrap.pl ../../apps/openssl smime -provider-path ../../providers -provider default -verify -in cms2pkcs7-62.cms -inform DER -CAfile ../../test/smime-certs/smroot.pem -out cms2pkcs7-6.txt -content ../../test/smcont.txt => 4
    not ok 6 - signed detached content DER format, add RSA signer (with DSA existing)
# ------------------------------------------------------------------------------

    #   Failed test 'signed detached content DER format, add RSA signer (with DSA existing)'
    #   at test/recipes/80-test_cms.t line 668.
    # CMD: openssl cms -provider-path ../../providers -provider default -sign -in ../../test/smcont.txt -outform DER -nodetach -stream -signer ../../test/smime-certs/smdsa1.pem -out cms2pkcs7-7.cms
../../util/wrap.pl ../../apps/openssl cms -provider-path ../../providers -provider default -sign -in ../../test/smcont.txt -outform DER -nodetach -stream -signer ../../test/smime-certs/smdsa1.pem -out cms2pkcs7-7.cms => 0
    # CMD: openssl smime -provider-path ../../providers -provider default -verify -in cms2pkcs7-7.cms -inform DER -CAfile ../../test/smime-certs/smroot.pem -out cms2pkcs7-7.txt
Verification failure
0000F4B6:error:10800075:PKCS7 routines:(unknown function):certificate verify error:crypto/pkcs7/pk7_smime.c:293:Verify error: certificate has expired
../../util/wrap.pl ../../apps/openssl smime -provider-path ../../providers -provider default -verify -in cms2pkcs7-7.cms -inform DER -CAfile ../../test/smime-certs/smroot.pem -out cms2pkcs7-7.txt => 4
    not ok 7 - signed content test streaming BER format, DSA key
# ------------------------------------------------------------------------------

    #   Failed test 'signed content test streaming BER format, DSA key'
    #   at test/recipes/80-test_cms.t line 668.
    # CMD: openssl cms -provider-path ../../providers -provider default -sign -in ../../test/smcont.txt -outform DER -nodetach -stream -signer ../../test/smime-certs/smrsa1.pem -signer ../../test/smime-certs/smrsa2.pem -signer ../../test/smime-certs/smdsa1.pem -signer ../../test/smime-certs/smdsa2.pem -out cms2pkcs7-8.cms
../../util/wrap.pl ../../apps/openssl cms -provider-path ../../providers -provider default -sign -in ../../test/smcont.txt -outform DER -nodetach -stream -signer ../../test/smime-certs/smrsa1.pem -signer ../../test/smime-certs/smrsa2.pem -signer ../../test/smime-certs/smdsa1.pem -signer ../../test/smime-certs/smdsa2.pem -out cms2pkcs7-8.cms => 0
    # CMD: openssl smime -provider-path ../../providers -provider default -verify -in cms2pkcs7-8.cms -inform DER -CAfile ../../test/smime-certs/smroot.pem -out cms2pkcs7-8.txt
Verification failure
0070F5B6:error:10800075:PKCS7 routines:(unknown function):certificate verify error:crypto/pkcs7/pk7_smime.c:293:Verify error: certificate has expired
../../util/wrap.pl ../../apps/openssl smime -provider-path ../../providers -provider default -verify -in cms2pkcs7-8.cms -inform DER -CAfile ../../test/smime-certs/smroot.pem -out cms2pkcs7-8.txt => 4
    not ok 8 - signed content test streaming BER format, 2 DSA and 2 RSA keys
# ------------------------------------------------------------------------------

    #   Failed test 'signed content test streaming BER format, 2 DSA and 2 RSA keys'
    #   at test/recipes/80-test_cms.t line 668.
    # CMD: openssl cms -provider-path ../../providers -provider default -sign -in ../../test/smcont.txt -outform DER -noattr -nodetach -stream -signer ../../test/smime-certs/smrsa1.pem -signer ../../test/smime-certs/smrsa2.pem -signer ../../test/smime-certs/smdsa1.pem -signer ../../test/smime-certs/smdsa2.pem -out cms2pkcs7-9.cms
../../util/wrap.pl ../../apps/openssl cms -provider-path ../../providers -provider default -sign -in ../../test/smcont.txt -outform DER -noattr -nodetach -stream -signer ../../test/smime-certs/smrsa1.pem -signer ../../test/smime-certs/smrsa2.pem -signer ../../test/smime-certs/smdsa1.pem -signer ../../test/smime-certs/smdsa2.pem -out cms2pkcs7-9.cms => 0
    # CMD: openssl smime -provider-path ../../providers -provider default -verify -in cms2pkcs7-9.cms -inform DER -CAfile ../../test/smime-certs/smroot.pem -out cms2pkcs7-9.txt
Verification failure
0040F1B6:error:10800075:PKCS7 routines:(unknown function):certificate verify error:crypto/pkcs7/pk7_smime.c:293:Verify error: certificate has expired
../../util/wrap.pl ../../apps/openssl smime -provider-path ../../providers -provider default -verify -in cms2pkcs7-9.cms -inform DER -CAfile ../../test/smime-certs/smroot.pem -out cms2pkcs7-9.txt => 4
    not ok 9 - signed content test streaming BER format, 2 DSA and 2 RSA keys, no attributes
# ------------------------------------------------------------------------------

    #   Failed test 'signed content test streaming BER format, 2 DSA and 2 RSA keys, no attributes'
    #   at test/recipes/80-test_cms.t line 668.
    # CMD: openssl cms -provider-path ../../providers -provider default -sign -in ../../test/smcont.txt -md sha1 -certfile ../../test/smime-certs/smroot.pem -signer ../../test/smime-certs/smrsa1.pem -out cms2pkcs7-10.cms
../../util/wrap.pl ../../apps/openssl cms -provider-path ../../providers -provider default -sign -in ../../test/smcont.txt -md sha1 -certfile ../../test/smime-certs/smroot.pem -signer ../../test/smime-certs/smrsa1.pem -out cms2pkcs7-10.cms => 0
    # CMD: openssl smime -provider-path ../../providers -provider default -verify -in cms2pkcs7-10.cms -CAfile ../../test/smime-certs/smroot.pem -out cms2pkcs7-10.txt
Verification failure
0010F4B6:error:10800075:PKCS7 routines:(unknown function):certificate verify error:crypto/pkcs7/pk7_smime.c:293:Verify error: certificate has expired
../../util/wrap.pl ../../apps/openssl smime -provider-path ../../providers -provider default -verify -in cms2pkcs7-10.cms -CAfile ../../test/smime-certs/smroot.pem -out cms2pkcs7-10.txt => 4
    not ok 10 - signed content S/MIME format, RSA key SHA1
# ------------------------------------------------------------------------------

    #   Failed test 'signed content S/MIME format, RSA key SHA1'
    #   at test/recipes/80-test_cms.t line 668.
    # CMD: openssl cms -provider-path ../../providers -provider default -sign -in ../../test/smcont_zero.txt -md sha1 -certfile ../../test/smime-certs/smroot.pem -signer ../../test/smime-certs/smrsa1.pem -out cms2pkcs7-11.cms
../../util/wrap.pl ../../apps/openssl cms -provider-path ../../providers -provider default -sign -in ../../test/smcont_zero.txt -md sha1 -certfile ../../test/smime-certs/smroot.pem -signer ../../test/smime-certs/smrsa1.pem -out cms2pkcs7-11.cms => 0
    # CMD: openssl smime -provider-path ../../providers -provider default -verify -in cms2pkcs7-11.cms -CAfile ../../test/smime-certs/smroot.pem -out cms2pkcs7-11.txt
Verification failure
00B0F0B6:error:10800075:PKCS7 routines:(unknown function):certificate verify error:crypto/pkcs7/pk7_smime.c:293:Verify error: certificate has expired
../../util/wrap.pl ../../apps/openssl smime -provider-path ../../providers -provider default -verify -in cms2pkcs7-11.cms -CAfile ../../test/smime-certs/smroot.pem -out cms2pkcs7-11.txt => 4
    not ok 11 - signed zero-length content S/MIME format, RSA key SHA1
# ------------------------------------------------------------------------------

    #   Failed test 'signed zero-length content S/MIME format, RSA key SHA1'
    #   at test/recipes/80-test_cms.t line 668.
    # CMD: openssl cms -provider-path ../../providers -provider default -sign -in ../../test/smcont.txt -nodetach -signer ../../test/smime-certs/smrsa1.pem -signer ../../test/smime-certs/smrsa2.pem -signer ../../test/smime-certs/smdsa1.pem -signer ../../test/smime-certs/smdsa2.pem -stream -out cms2pkcs7-12.cms
../../util/wrap.pl ../../apps/openssl cms -provider-path ../../providers -provider default -sign -in ../../test/smcont.txt -nodetach -signer ../../test/smime-certs/smrsa1.pem -signer ../../test/smime-certs/smrsa2.pem -signer ../../test/smime-certs/smdsa1.pem -signer ../../test/smime-certs/smdsa2.pem -stream -out cms2pkcs7-12.cms => 0
    # CMD: openssl smime -provider-path ../../providers -provider default -verify -in cms2pkcs7-12.cms -CAfile ../../test/smime-certs/smroot.pem -out cms2pkcs7-12.txt
Verification failure
00A0FBB6:error:10800075:PKCS7 routines:(unknown function):certificate verify error:crypto/pkcs7/pk7_smime.c:293:Verify error: certificate has expired
../../util/wrap.pl ../../apps/openssl smime -provider-path ../../providers -provider default -verify -in cms2pkcs7-12.cms -CAfile ../../test/smime-certs/smroot.pem -out cms2pkcs7-12.txt => 4
    not ok 12 - signed content test streaming S/MIME format, 2 DSA and 2 RSA keys
# ------------------------------------------------------------------------------

    #   Failed test 'signed content test streaming S/MIME format, 2 DSA and 2 RSA keys'
    #   at test/recipes/80-test_cms.t line 668.
    # CMD: openssl cms -provider-path ../../providers -provider default -sign -in ../../test/smcont.txt -signer ../../test/smime-certs/smrsa1.pem -signer ../../test/smime-certs/smrsa2.pem -signer ../../test/smime-certs/smdsa1.pem -signer ../../test/smime-certs/smdsa2.pem -stream -out cms2pkcs7-13.cms
../../util/wrap.pl ../../apps/openssl cms -provider-path ../../providers -provider default -sign -in ../../test/smcont.txt -signer ../../test/smime-certs/smrsa1.pem -signer ../../test/smime-certs/smrsa2.pem -signer ../../test/smime-certs/smdsa1.pem -signer ../../test/smime-certs/smdsa2.pem -stream -out cms2pkcs7-13.cms => 0
    # CMD: openssl smime -provider-path ../../providers -provider default -verify -in cms2pkcs7-13.cms -CAfile ../../test/smime-certs/smroot.pem -out cms2pkcs7-13.txt
Verification failure
0020F8B6:error:10800075:PKCS7 routines:(unknown function):certificate verify error:crypto/pkcs7/pk7_smime.c:293:Verify error: certificate has expired
../../util/wrap.pl ../../apps/openssl smime -provider-path ../../providers -provider default -verify -in cms2pkcs7-13.cms -CAfile ../../test/smime-certs/smroot.pem -out cms2pkcs7-13.txt => 4
    not ok 13 - signed content test streaming multipart S/MIME format, 2 DSA and 2 RSA keys
# ------------------------------------------------------------------------------
    # Looks like you failed 13 tests of 17.
not ok 2 - CMS => PKCS\#7 compatibility tests
80-test_cms.t ...................... 2/? ---------------------------------------
    # CMD: openssl smime -provider-path ../../providers -provider default -sign -in ../../test/smcont.txt -outform DER -nodetach -certfile ../../test/smime-certs/smroot.pem -signer ../../test/smime-certs/smrsa1.pem -out pkcs72cms-1.cms
../../util/wrap.pl ../../apps/openssl smime -provider-path ../../providers -provider default -sign -in ../../test/smcont.txt -outform DER -nodetach -certfile ../../test/smime-certs/smroot.pem -signer ../../test/smime-certs/smrsa1.pem -out pkcs72cms-1.cms => 0
    # CMD: openssl cms -provider-path ../../providers -provider default -verify -in pkcs72cms-1.cms -inform DER -CAfile ../../test/smime-certs/smroot.pem -out pkcs72cms-1.txt
CMS Verification failure
0060F6B6:error:17000064:CMS routines:(unknown function):certificate verify error:crypto/cms/cms_smime.c:289:Verify error: certificate has expired
../../util/wrap.pl ../../apps/openssl cms -provider-path ../../providers -provider default -verify -in pkcs72cms-1.cms -inform DER -CAfile ../../test/smime-certs/smroot.pem -out pkcs72cms-1.txt => 4
    not ok 1 - signed content DER format, RSA key
# ------------------------------------------------------------------------------

    #   Failed test 'signed content DER format, RSA key'
    #   at test/recipes/80-test_cms.t line 668.
    # CMD: openssl smime -provider-path ../../providers -provider default -sign -in ../../test/smcont.txt -outform DER -signer ../../test/smime-certs/smrsa1.pem -out pkcs72cms-2.cms
../../util/wrap.pl ../../apps/openssl smime -provider-path ../../providers -provider default -sign -in ../../test/smcont.txt -outform DER -signer ../../test/smime-certs/smrsa1.pem -out pkcs72cms-2.cms => 0
    # CMD: openssl cms -provider-path ../../providers -provider default -verify -in pkcs72cms-2.cms -inform DER -CAfile ../../test/smime-certs/smroot.pem -out pkcs72cms-2.txt -content ../../test/smcont.txt
CMS Verification failure
0040F4B6:error:17000064:CMS routines:(unknown function):certificate verify error:crypto/cms/cms_smime.c:289:Verify error: certificate has expired
../../util/wrap.pl ../../apps/openssl cms -provider-path ../../providers -provider default -verify -in pkcs72cms-2.cms -inform DER -CAfile ../../test/smime-certs/smroot.pem -out pkcs72cms-2.txt -content ../../test/smcont.txt => 4
    not ok 2 - signed detached content DER format, RSA key
# ------------------------------------------------------------------------------

    #   Failed test 'signed detached content DER format, RSA key'
    #   at test/recipes/80-test_cms.t line 668.
    # CMD: openssl smime -provider-path ../../providers -provider default -sign -in ../../test/smcont.txt -outform DER -nodetach -stream -signer ../../test/smime-certs/smrsa1.pem -out pkcs72cms-3.cms
../../util/wrap.pl ../../apps/openssl smime -provider-path ../../providers -provider default -sign -in ../../test/smcont.txt -outform DER -nodetach -stream -signer ../../test/smime-certs/smrsa1.pem -out pkcs72cms-3.cms => 0
    # CMD: openssl cms -provider-path ../../providers -provider default -verify -in pkcs72cms-3.cms -inform DER -CAfile ../../test/smime-certs/smroot.pem -out pkcs72cms-3.txt
CMS Verification failure
00B0F4B6:error:17000064:CMS routines:(unknown function):certificate verify error:crypto/cms/cms_smime.c:289:Verify error: certificate has expired
../../util/wrap.pl ../../apps/openssl cms -provider-path ../../providers -provider default -verify -in pkcs72cms-3.cms -inform DER -CAfile ../../test/smime-certs/smroot.pem -out pkcs72cms-3.txt => 4
    not ok 3 - signed content test streaming BER format, RSA
# ------------------------------------------------------------------------------

    #   Failed test 'signed content test streaming BER format, RSA'
    #   at test/recipes/80-test_cms.t line 668.
    # CMD: openssl smime -provider-path ../../providers -provider default -sign -in ../../test/smcont.txt -outform DER -nodetach -signer ../../test/smime-certs/smdsa1.pem -out pkcs72cms-4.cms
../../util/wrap.pl ../../apps/openssl smime -provider-path ../../providers -provider default -sign -in ../../test/smcont.txt -outform DER -nodetach -signer ../../test/smime-certs/smdsa1.pem -out pkcs72cms-4.cms => 0
    # CMD: openssl cms -provider-path ../../providers -provider default -verify -in pkcs72cms-4.cms -inform DER -CAfile ../../test/smime-certs/smroot.pem -out pkcs72cms-4.txt
CMS Verification failure
0070FEB6:error:17000064:CMS routines:(unknown function):certificate verify error:crypto/cms/cms_smime.c:289:Verify error: certificate has expired
../../util/wrap.pl ../../apps/openssl cms -provider-path ../../providers -provider default -verify -in pkcs72cms-4.cms -inform DER -CAfile ../../test/smime-certs/smroot.pem -out pkcs72cms-4.txt => 4
    not ok 4 - signed content DER format, DSA key
# ------------------------------------------------------------------------------

    #   Failed test 'signed content DER format, DSA key'
    #   at test/recipes/80-test_cms.t line 668.
    # CMD: openssl smime -provider-path ../../providers -provider default -sign -in ../../test/smcont.txt -outform DER -signer ../../test/smime-certs/smdsa1.pem -out pkcs72cms-5.cms
../../util/wrap.pl ../../apps/openssl smime -provider-path ../../providers -provider default -sign -in ../../test/smcont.txt -outform DER -signer ../../test/smime-certs/smdsa1.pem -out pkcs72cms-5.cms => 0
    # CMD: openssl cms -provider-path ../../providers -provider default -verify -in pkcs72cms-5.cms -inform DER -CAfile ../../test/smime-certs/smroot.pem -out pkcs72cms-5.txt -content ../../test/smcont.txt
CMS Verification failure
00E0FBB6:error:17000064:CMS routines:(unknown function):certificate verify error:crypto/cms/cms_smime.c:289:Verify error: certificate has expired
../../util/wrap.pl ../../apps/openssl cms -provider-path ../../providers -provider default -verify -in pkcs72cms-5.cms -inform DER -CAfile ../../test/smime-certs/smroot.pem -out pkcs72cms-5.txt -content ../../test/smcont.txt => 4
    not ok 5 - signed detached content DER format, DSA key
# ------------------------------------------------------------------------------

    #   Failed test 'signed detached content DER format, DSA key'
    #   at test/recipes/80-test_cms.t line 668.
    # CMD: openssl smime -provider-path ../../providers -provider default -sign -in ../../test/smcont.txt -outform DER -signer ../../test/smime-certs/smdsa1.pem -out pkcs72cms-6.cms
../../util/wrap.pl ../../apps/openssl smime -provider-path ../../providers -provider default -sign -in ../../test/smcont.txt -outform DER -signer ../../test/smime-certs/smdsa1.pem -out pkcs72cms-6.cms => 0
    # CMD: openssl smime -provider-path ../../providers -provider default -resign -in pkcs72cms-6.cms -inform DER -outform DER -signer ../../test/smime-certs/smrsa1.pem -out pkcs72cms-62.cms
../../util/wrap.pl ../../apps/openssl smime -provider-path ../../providers -provider default -resign -in pkcs72cms-6.cms -inform DER -outform DER -signer ../../test/smime-certs/smrsa1.pem -out pkcs72cms-62.cms => 0
    # CMD: openssl cms -provider-path ../../providers -provider default -verify -in pkcs72cms-62.cms -inform DER -CAfile ../../test/smime-certs/smroot.pem -out pkcs72cms-6.txt -content ../../test/smcont.txt
CMS Verification failure
0080F6B6:error:17000064:CMS routines:(unknown function):certificate verify error:crypto/cms/cms_smime.c:289:Verify error: certificate has expired
../../util/wrap.pl ../../apps/openssl cms -provider-path ../../providers -provider default -verify -in pkcs72cms-62.cms -inform DER -CAfile ../../test/smime-certs/smroot.pem -out pkcs72cms-6.txt -content ../../test/smcont.txt => 4
    not ok 6 - signed detached content DER format, add RSA signer (with DSA existing)
# ------------------------------------------------------------------------------

    #   Failed test 'signed detached content DER format, add RSA signer (with DSA existing)'
    #   at test/recipes/80-test_cms.t line 668.
    # CMD: openssl smime -provider-path ../../providers -provider default -sign -in ../../test/smcont.txt -outform DER -nodetach -stream -signer ../../test/smime-certs/smdsa1.pem -out pkcs72cms-7.cms
../../util/wrap.pl ../../apps/openssl smime -provider-path ../../providers -provider default -sign -in ../../test/smcont.txt -outform DER -nodetach -stream -signer ../../test/smime-certs/smdsa1.pem -out pkcs72cms-7.cms => 0
    # CMD: openssl cms -provider-path ../../providers -provider default -verify -in pkcs72cms-7.cms -inform DER -CAfile ../../test/smime-certs/smroot.pem -out pkcs72cms-7.txt
CMS Verification failure
00E0F0B6:error:17000064:CMS routines:(unknown function):certificate verify error:crypto/cms/cms_smime.c:289:Verify error: certificate has expired
../../util/wrap.pl ../../apps/openssl cms -provider-path ../../providers -provider default -verify -in pkcs72cms-7.cms -inform DER -CAfile ../../test/smime-certs/smroot.pem -out pkcs72cms-7.txt => 4
    not ok 7 - signed content test streaming BER format, DSA key
# ------------------------------------------------------------------------------

    #   Failed test 'signed content test streaming BER format, DSA key'
    #   at test/recipes/80-test_cms.t line 668.
    # CMD: openssl smime -provider-path ../../providers -provider default -sign -in ../../test/smcont.txt -outform DER -nodetach -stream -signer ../../test/smime-certs/smrsa1.pem -signer ../../test/smime-certs/smrsa2.pem -signer ../../test/smime-certs/smdsa1.pem -signer ../../test/smime-certs/smdsa2.pem -out pkcs72cms-8.cms
../../util/wrap.pl ../../apps/openssl smime -provider-path ../../providers -provider default -sign -in ../../test/smcont.txt -outform DER -nodetach -stream -signer ../../test/smime-certs/smrsa1.pem -signer ../../test/smime-certs/smrsa2.pem -signer ../../test/smime-certs/smdsa1.pem -signer ../../test/smime-certs/smdsa2.pem -out pkcs72cms-8.cms => 0
    # CMD: openssl cms -provider-path ../../providers -provider default -verify -in pkcs72cms-8.cms -inform DER -CAfile ../../test/smime-certs/smroot.pem -out pkcs72cms-8.txt
CMS Verification failure
0020F3B6:error:17000064:CMS routines:(unknown function):certificate verify error:crypto/cms/cms_smime.c:289:Verify error: certificate has expired
../../util/wrap.pl ../../apps/openssl cms -provider-path ../../providers -provider default -verify -in pkcs72cms-8.cms -inform DER -CAfile ../../test/smime-certs/smroot.pem -out pkcs72cms-8.txt => 4
    not ok 8 - signed content test streaming BER format, 2 DSA and 2 RSA keys
# ------------------------------------------------------------------------------

    #   Failed test 'signed content test streaming BER format, 2 DSA and 2 RSA keys'
    #   at test/recipes/80-test_cms.t line 668.
    # CMD: openssl smime -provider-path ../../providers -provider default -sign -in ../../test/smcont.txt -outform DER -noattr -nodetach -stream -signer ../../test/smime-certs/smrsa1.pem -signer ../../test/smime-certs/smrsa2.pem -signer ../../test/smime-certs/smdsa1.pem -signer ../../test/smime-certs/smdsa2.pem -out pkcs72cms-9.cms
../../util/wrap.pl ../../apps/openssl smime -provider-path ../../providers -provider default -sign -in ../../test/smcont.txt -outform DER -noattr -nodetach -stream -signer ../../test/smime-certs/smrsa1.pem -signer ../../test/smime-certs/smrsa2.pem -signer ../../test/smime-certs/smdsa1.pem -signer ../../test/smime-certs/smdsa2.pem -out pkcs72cms-9.cms => 0
    # CMD: openssl cms -provider-path ../../providers -provider default -verify -in pkcs72cms-9.cms -inform DER -CAfile ../../test/smime-certs/smroot.pem -out pkcs72cms-9.txt
CMS Verification failure
00E0F4B6:error:17000064:CMS routines:(unknown function):certificate verify error:crypto/cms/cms_smime.c:289:Verify error: certificate has expired
../../util/wrap.pl ../../apps/openssl cms -provider-path ../../providers -provider default -verify -in pkcs72cms-9.cms -inform DER -CAfile ../../test/smime-certs/smroot.pem -out pkcs72cms-9.txt => 4
    not ok 9 - signed content test streaming BER format, 2 DSA and 2 RSA keys, no attributes
# ------------------------------------------------------------------------------

    #   Failed test 'signed content test streaming BER format, 2 DSA and 2 RSA keys, no attributes'
    #   at test/recipes/80-test_cms.t line 668.
    # CMD: openssl smime -provider-path ../../providers -provider default -sign -in ../../test/smcont.txt -md sha1 -certfile ../../test/smime-certs/smroot.pem -signer ../../test/smime-certs/smrsa1.pem -out pkcs72cms-10.cms
../../util/wrap.pl ../../apps/openssl smime -provider-path ../../providers -provider default -sign -in ../../test/smcont.txt -md sha1 -certfile ../../test/smime-certs/smroot.pem -signer ../../test/smime-certs/smrsa1.pem -out pkcs72cms-10.cms => 0
    # CMD: openssl cms -provider-path ../../providers -provider default -verify -in pkcs72cms-10.cms -CAfile ../../test/smime-certs/smroot.pem -out pkcs72cms-10.txt
CMS Verification failure
0090F3B6:error:17000064:CMS routines:(unknown function):certificate verify error:crypto/cms/cms_smime.c:289:Verify error: certificate has expired
../../util/wrap.pl ../../apps/openssl cms -provider-path ../../providers -provider default -verify -in pkcs72cms-10.cms -CAfile ../../test/smime-certs/smroot.pem -out pkcs72cms-10.txt => 4
    not ok 10 - signed content S/MIME format, RSA key SHA1
# ------------------------------------------------------------------------------

    #   Failed test 'signed content S/MIME format, RSA key SHA1'
    #   at test/recipes/80-test_cms.t line 668.
    # CMD: openssl smime -provider-path ../../providers -provider default -sign -in ../../test/smcont_zero.txt -md sha1 -certfile ../../test/smime-certs/smroot.pem -signer ../../test/smime-certs/smrsa1.pem -out pkcs72cms-11.cms
../../util/wrap.pl ../../apps/openssl smime -provider-path ../../providers -provider default -sign -in ../../test/smcont_zero.txt -md sha1 -certfile ../../test/smime-certs/smroot.pem -signer ../../test/smime-certs/smrsa1.pem -out pkcs72cms-11.cms => 0
    # CMD: openssl cms -provider-path ../../providers -provider default -verify -in pkcs72cms-11.cms -CAfile ../../test/smime-certs/smroot.pem -out pkcs72cms-11.txt
CMS Verification failure
00E0FAB6:error:17000064:CMS routines:(unknown function):certificate verify error:crypto/cms/cms_smime.c:289:Verify error: certificate has expired
../../util/wrap.pl ../../apps/openssl cms -provider-path ../../providers -provider default -verify -in pkcs72cms-11.cms -CAfile ../../test/smime-certs/smroot.pem -out pkcs72cms-11.txt => 4
    not ok 11 - signed zero-length content S/MIME format, RSA key SHA1
# ------------------------------------------------------------------------------

    #   Failed test 'signed zero-length content S/MIME format, RSA key SHA1'
    #   at test/recipes/80-test_cms.t line 668.
    # CMD: openssl smime -provider-path ../../providers -provider default -sign -in ../../test/smcont.txt -nodetach -signer ../../test/smime-certs/smrsa1.pem -signer ../../test/smime-certs/smrsa2.pem -signer ../../test/smime-certs/smdsa1.pem -signer ../../test/smime-certs/smdsa2.pem -stream -out pkcs72cms-12.cms
../../util/wrap.pl ../../apps/openssl smime -provider-path ../../providers -provider default -sign -in ../../test/smcont.txt -nodetach -signer ../../test/smime-certs/smrsa1.pem -signer ../../test/smime-certs/smrsa2.pem -signer ../../test/smime-certs/smdsa1.pem -signer ../../test/smime-certs/smdsa2.pem -stream -out pkcs72cms-12.cms => 0
    # CMD: openssl cms -provider-path ../../providers -provider default -verify -in pkcs72cms-12.cms -CAfile ../../test/smime-certs/smroot.pem -out pkcs72cms-12.txt
CMS Verification failure
0000F7B6:error:17000064:CMS routines:(unknown function):certificate verify error:crypto/cms/cms_smime.c:289:Verify error: certificate has expired
../../util/wrap.pl ../../apps/openssl cms -provider-path ../../providers -provider default -verify -in pkcs72cms-12.cms -CAfile ../../test/smime-certs/smroot.pem -out pkcs72cms-12.txt => 4
    not ok 12 - signed content test streaming S/MIME format, 2 DSA and 2 RSA keys
# ------------------------------------------------------------------------------

    #   Failed test 'signed content test streaming S/MIME format, 2 DSA and 2 RSA keys'
    #   at test/recipes/80-test_cms.t line 668.
    # CMD: openssl smime -provider-path ../../providers -provider default -sign -in ../../test/smcont.txt -signer ../../test/smime-certs/smrsa1.pem -signer ../../test/smime-certs/smrsa2.pem -signer ../../test/smime-certs/smdsa1.pem -signer ../../test/smime-certs/smdsa2.pem -stream -out pkcs72cms-13.cms
../../util/wrap.pl ../../apps/openssl smime -provider-path ../../providers -provider default -sign -in ../../test/smcont.txt -signer ../../test/smime-certs/smrsa1.pem -signer ../../test/smime-certs/smrsa2.pem -signer ../../test/smime-certs/smdsa1.pem -signer ../../test/smime-certs/smdsa2.pem -stream -out pkcs72cms-13.cms => 0
    # CMD: openssl cms -provider-path ../../providers -provider default -verify -in pkcs72cms-13.cms -CAfile ../../test/smime-certs/smroot.pem -out pkcs72cms-13.txt
CMS Verification failure
0070FBB6:error:17000064:CMS routines:(unknown function):certificate verify error:crypto/cms/cms_smime.c:289:Verify error: certificate has expired
../../util/wrap.pl ../../apps/openssl cms -provider-path ../../providers -provider default -verify -in pkcs72cms-13.cms -CAfile ../../test/smime-certs/smroot.pem -out pkcs72cms-13.txt => 4
    not ok 13 - signed content test streaming multipart S/MIME format, 2 DSA and 2 RSA keys
# ------------------------------------------------------------------------------
    # Looks like you failed 13 tests of 17.
not ok 3 - CMS <= PKCS\#7 compatibility tests
80-test_cms.t ...................... 3/? ---------------------------------------
    # CMD: openssl cms -provider-path ../../providers -provider default -sign -in ../../test/smcont.txt -outform DER -nodetach -certfile ../../test/smime-certs/smroot.pem -signer ../../test/smime-certs/smrsa1.pem -out cms2cms-1-1.cms
../../util/wrap.pl ../../apps/openssl cms -provider-path ../../providers -provider default -sign -in ../../test/smcont.txt -outform DER -nodetach -certfile ../../test/smime-certs/smroot.pem -signer ../../test/smime-certs/smrsa1.pem -out cms2cms-1-1.cms => 0
    # CMD: openssl cms -provider-path ../../providers -provider default -verify -in cms2cms-1-1.cms -inform DER -CAfile ../../test/smime-certs/smroot.pem -out cms2cms-1-1.txt
CMS Verification failure
0080FDB6:error:17000064:CMS routines:(unknown function):certificate verify error:crypto/cms/cms_smime.c:289:Verify error: certificate has expired
../../util/wrap.pl ../../apps/openssl cms -provider-path ../../providers -provider default -verify -in cms2cms-1-1.cms -inform DER -CAfile ../../test/smime-certs/smroot.pem -out cms2cms-1-1.txt => 4
    not ok 1 - signed content DER format, RSA key
# ------------------------------------------------------------------------------

    #   Failed test 'signed content DER format, RSA key'
    #   at test/recipes/80-test_cms.t line 668.
    # CMD: openssl cms -provider-path ../../providers -provider default -sign -in ../../test/smcont.txt -outform DER -signer ../../test/smime-certs/smrsa1.pem -out cms2cms-1-2.cms
../../util/wrap.pl ../../apps/openssl cms -provider-path ../../providers -provider default -sign -in ../../test/smcont.txt -outform DER -signer ../../test/smime-certs/smrsa1.pem -out cms2cms-1-2.cms => 0
    # CMD: openssl cms -provider-path ../../providers -provider default -verify -in cms2cms-1-2.cms -inform DER -CAfile ../../test/smime-certs/smroot.pem -out cms2cms-1-2.txt -content ../../test/smcont.txt
CMS Verification failure
0070F3B6:error:17000064:CMS routines:(unknown function):certificate verify error:crypto/cms/cms_smime.c:289:Verify error: certificate has expired
../../util/wrap.pl ../../apps/openssl cms -provider-path ../../providers -provider default -verify -in cms2cms-1-2.cms -inform DER -CAfile ../../test/smime-certs/smroot.pem -out cms2cms-1-2.txt -content ../../test/smcont.txt => 4
    not ok 2 - signed detached content DER format, RSA key
# ------------------------------------------------------------------------------

    #   Failed test 'signed detached content DER format, RSA key'
    #   at test/recipes/80-test_cms.t line 668.
    # CMD: openssl cms -provider-path ../../providers -provider default -sign -in ../../test/smcont.txt -outform DER -nodetach -stream -signer ../../test/smime-certs/smrsa1.pem -out cms2cms-1-3.cms
../../util/wrap.pl ../../apps/openssl cms -provider-path ../../providers -provider default -sign -in ../../test/smcont.txt -outform DER -nodetach -stream -signer ../../test/smime-certs/smrsa1.pem -out cms2cms-1-3.cms => 0
    # CMD: openssl cms -provider-path ../../providers -provider default -verify -in cms2cms-1-3.cms -inform DER -CAfile ../../test/smime-certs/smroot.pem -out cms2cms-1-3.txt
CMS Verification failure
0070F7B6:error:17000064:CMS routines:(unknown function):certificate verify error:crypto/cms/cms_smime.c:289:Verify error: certificate has expired
../../util/wrap.pl ../../apps/openssl cms -provider-path ../../providers -provider default -verify -in cms2cms-1-3.cms -inform DER -CAfile ../../test/smime-certs/smroot.pem -out cms2cms-1-3.txt => 4
    not ok 3 - signed content test streaming BER format, RSA
# ------------------------------------------------------------------------------

    #   Failed test 'signed content test streaming BER format, RSA'
    #   at test/recipes/80-test_cms.t line 668.
    # CMD: openssl cms -provider-path ../../providers -provider default -sign -in ../../test/smcont.txt -outform DER -nodetach -signer ../../test/smime-certs/smdsa1.pem -out cms2cms-1-4.cms
../../util/wrap.pl ../../apps/openssl cms -provider-path ../../providers -provider default -sign -in ../../test/smcont.txt -outform DER -nodetach -signer ../../test/smime-certs/smdsa1.pem -out cms2cms-1-4.cms => 0
    # CMD: openssl cms -provider-path ../../providers -provider default -verify -in cms2cms-1-4.cms -inform DER -CAfile ../../test/smime-certs/smroot.pem -out cms2cms-1-4.txt
CMS Verification failure
0060F2B6:error:17000064:CMS routines:(unknown function):certificate verify error:crypto/cms/cms_smime.c:289:Verify error: certificate has expired
../../util/wrap.pl ../../apps/openssl cms -provider-path ../../providers -provider default -verify -in cms2cms-1-4.cms -inform DER -CAfile ../../test/smime-certs/smroot.pem -out cms2cms-1-4.txt => 4
    not ok 4 - signed content DER format, DSA key
# ------------------------------------------------------------------------------

    #   Failed test 'signed content DER format, DSA key'
    #   at test/recipes/80-test_cms.t line 668.
    # CMD: openssl cms -provider-path ../../providers -provider default -sign -in ../../test/smcont.txt -outform DER -signer ../../test/smime-certs/smdsa1.pem -out cms2cms-1-5.cms
../../util/wrap.pl ../../apps/openssl cms -provider-path ../../providers -provider default -sign -in ../../test/smcont.txt -outform DER -signer ../../test/smime-certs/smdsa1.pem -out cms2cms-1-5.cms => 0
    # CMD: openssl cms -provider-path ../../providers -provider default -verify -in cms2cms-1-5.cms -inform DER -CAfile ../../test/smime-certs/smroot.pem -out cms2cms-1-5.txt -content ../../test/smcont.txt
CMS Verification failure
00F0FBB6:error:17000064:CMS routines:(unknown function):certificate verify error:crypto/cms/cms_smime.c:289:Verify error: certificate has expired
../../util/wrap.pl ../../apps/openssl cms -provider-path ../../providers -provider default -verify -in cms2cms-1-5.cms -inform DER -CAfile ../../test/smime-certs/smroot.pem -out cms2cms-1-5.txt -content ../../test/smcont.txt => 4
    not ok 5 - signed detached content DER format, DSA key
# ------------------------------------------------------------------------------

    #   Failed test 'signed detached content DER format, DSA key'
    #   at test/recipes/80-test_cms.t line 668.
    # CMD: openssl cms -provider-path ../../providers -provider default -sign -in ../../test/smcont.txt -outform DER -signer ../../test/smime-certs/smdsa1.pem -out cms2cms-1-6.cms
../../util/wrap.pl ../../apps/openssl cms -provider-path ../../providers -provider default -sign -in ../../test/smcont.txt -outform DER -signer ../../test/smime-certs/smdsa1.pem -out cms2cms-1-6.cms => 0
    # CMD: openssl cms -provider-path ../../providers -provider default -resign -in cms2cms-1-6.cms -inform DER -outform DER -signer ../../test/smime-certs/smrsa1.pem -out cms2cms-1-62.cms
../../util/wrap.pl ../../apps/openssl cms -provider-path ../../providers -provider default -resign -in cms2cms-1-6.cms -inform DER -outform DER -signer ../../test/smime-certs/smrsa1.pem -out cms2cms-1-62.cms => 0
    # CMD: openssl cms -provider-path ../../providers -provider default -verify -in cms2cms-1-62.cms -inform DER -CAfile ../../test/smime-certs/smroot.pem -out cms2cms-1-6.txt -content ../../test/smcont.txt
CMS Verification failure
00F0F6B6:error:17000064:CMS routines:(unknown function):certificate verify error:crypto/cms/cms_smime.c:289:Verify error: certificate has expired
../../util/wrap.pl ../../apps/openssl cms -provider-path ../../providers -provider default -verify -in cms2cms-1-62.cms -inform DER -CAfile ../../test/smime-certs/smroot.pem -out cms2cms-1-6.txt -content ../../test/smcont.txt => 4
    not ok 6 - signed detached content DER format, add RSA signer (with DSA existing)
# ------------------------------------------------------------------------------

    #   Failed test 'signed detached content DER format, add RSA signer (with DSA existing)'
    #   at test/recipes/80-test_cms.t line 668.
    # CMD: openssl cms -provider-path ../../providers -provider default -sign -in ../../test/smcont.txt -outform DER -nodetach -stream -signer ../../test/smime-certs/smdsa1.pem -out cms2cms-1-7.cms
../../util/wrap.pl ../../apps/openssl cms -provider-path ../../providers -provider default -sign -in ../../test/smcont.txt -outform DER -nodetach -stream -signer ../../test/smime-certs/smdsa1.pem -out cms2cms-1-7.cms => 0
    # CMD: openssl cms -provider-path ../../providers -provider default -verify -in cms2cms-1-7.cms -inform DER -CAfile ../../test/smime-certs/smroot.pem -out cms2cms-1-7.txt
CMS Verification failure
0050F4B6:error:17000064:CMS routines:(unknown function):certificate verify error:crypto/cms/cms_smime.c:289:Verify error: certificate has expired
../../util/wrap.pl ../../apps/openssl cms -provider-path ../../providers -provider default -verify -in cms2cms-1-7.cms -inform DER -CAfile ../../test/smime-certs/smroot.pem -out cms2cms-1-7.txt => 4
    not ok 7 - signed content test streaming BER format, DSA key
# ------------------------------------------------------------------------------

    #   Failed test 'signed content test streaming BER format, DSA key'
    #   at test/recipes/80-test_cms.t line 668.
    # CMD: openssl cms -provider-path ../../providers -provider default -sign -in ../../test/smcont.txt -outform DER -nodetach -stream -signer ../../test/smime-certs/smrsa1.pem -signer ../../test/smime-certs/smrsa2.pem -signer ../../test/smime-certs/smdsa1.pem -signer ../../test/smime-certs/smdsa2.pem -out cms2cms-1-8.cms
../../util/wrap.pl ../../apps/openssl cms -provider-path ../../providers -provider default -sign -in ../../test/smcont.txt -outform DER -nodetach -stream -signer ../../test/smime-certs/smrsa1.pem -signer ../../test/smime-certs/smrsa2.pem -signer ../../test/smime-certs/smdsa1.pem -signer ../../test/smime-certs/smdsa2.pem -out cms2cms-1-8.cms => 0
    # CMD: openssl cms -provider-path ../../providers -provider default -verify -in cms2cms-1-8.cms -inform DER -CAfile ../../test/smime-certs/smroot.pem -out cms2cms-1-8.txt
CMS Verification failure
00F0FDB6:error:17000064:CMS routines:(unknown function):certificate verify error:crypto/cms/cms_smime.c:289:Verify error: certificate has expired
../../util/wrap.pl ../../apps/openssl cms -provider-path ../../providers -provider default -verify -in cms2cms-1-8.cms -inform DER -CAfile ../../test/smime-certs/smroot.pem -out cms2cms-1-8.txt => 4
    not ok 8 - signed content test streaming BER format, 2 DSA and 2 RSA keys
# ------------------------------------------------------------------------------

    #   Failed test 'signed content test streaming BER format, 2 DSA and 2 RSA keys'
    #   at test/recipes/80-test_cms.t line 668.
    # CMD: openssl cms -provider-path ../../providers -provider default -sign -in ../../test/smcont.txt -outform DER -noattr -nodetach -stream -signer ../../test/smime-certs/smrsa1.pem -signer ../../test/smime-certs/smrsa2.pem -signer ../../test/smime-certs/smdsa1.pem -signer ../../test/smime-certs/smdsa2.pem -out cms2cms-1-9.cms
../../util/wrap.pl ../../apps/openssl cms -provider-path ../../providers -provider default -sign -in ../../test/smcont.txt -outform DER -noattr -nodetach -stream -signer ../../test/smime-certs/smrsa1.pem -signer ../../test/smime-certs/smrsa2.pem -signer ../../test/smime-certs/smdsa1.pem -signer ../../test/smime-certs/smdsa2.pem -out cms2cms-1-9.cms => 0
    # CMD: openssl cms -provider-path ../../providers -provider default -verify -in cms2cms-1-9.cms -inform DER -CAfile ../../test/smime-certs/smroot.pem -out cms2cms-1-9.txt
CMS Verification failure
00D0F1B6:error:17000064:CMS routines:(unknown function):certificate verify error:crypto/cms/cms_smime.c:289:Verify error: certificate has expired
../../util/wrap.pl ../../apps/openssl cms -provider-path ../../providers -provider default -verify -in cms2cms-1-9.cms -inform DER -CAfile ../../test/smime-certs/smroot.pem -out cms2cms-1-9.txt => 4
    not ok 9 - signed content test streaming BER format, 2 DSA and 2 RSA keys, no attributes
# ------------------------------------------------------------------------------

    #   Failed test 'signed content test streaming BER format, 2 DSA and 2 RSA keys, no attributes'
    #   at test/recipes/80-test_cms.t line 668.
    # CMD: openssl cms -provider-path ../../providers -provider default -sign -in ../../test/smcont.txt -md sha1 -certfile ../../test/smime-certs/smroot.pem -signer ../../test/smime-certs/smrsa1.pem -out cms2cms-1-10.cms
../../util/wrap.pl ../../apps/openssl cms -provider-path ../../providers -provider default -sign -in ../../test/smcont.txt -md sha1 -certfile ../../test/smime-certs/smroot.pem -signer ../../test/smime-certs/smrsa1.pem -out cms2cms-1-10.cms => 0
    # CMD: openssl cms -provider-path ../../providers -provider default -verify -in cms2cms-1-10.cms -CAfile ../../test/smime-certs/smroot.pem -out cms2cms-1-10.txt
CMS Verification failure
0080F5B6:error:17000064:CMS routines:(unknown function):certificate verify error:crypto/cms/cms_smime.c:289:Verify error: certificate has expired
../../util/wrap.pl ../../apps/openssl cms -provider-path ../../providers -provider default -verify -in cms2cms-1-10.cms -CAfile ../../test/smime-certs/smroot.pem -out cms2cms-1-10.txt => 4
    not ok 10 - signed content S/MIME format, RSA key SHA1
# ------------------------------------------------------------------------------

    #   Failed test 'signed content S/MIME format, RSA key SHA1'
    #   at test/recipes/80-test_cms.t line 668.
    # CMD: openssl cms -provider-path ../../providers -provider default -sign -in ../../test/smcont_zero.txt -md sha1 -certfile ../../test/smime-certs/smroot.pem -signer ../../test/smime-certs/smrsa1.pem -out cms2cms-1-11.cms
../../util/wrap.pl ../../apps/openssl cms -provider-path ../../providers -provider default -sign -in ../../test/smcont_zero.txt -md sha1 -certfile ../../test/smime-certs/smroot.pem -signer ../../test/smime-certs/smrsa1.pem -out cms2cms-1-11.cms => 0
    # CMD: openssl cms -provider-path ../../providers -provider default -verify -in cms2cms-1-11.cms -CAfile ../../test/smime-certs/smroot.pem -out cms2cms-1-11.txt
CMS Verification failure
0020F3B6:error:17000064:CMS routines:(unknown function):certificate verify error:crypto/cms/cms_smime.c:289:Verify error: certificate has expired
../../util/wrap.pl ../../apps/openssl cms -provider-path ../../providers -provider default -verify -in cms2cms-1-11.cms -CAfile ../../test/smime-certs/smroot.pem -out cms2cms-1-11.txt => 4
    not ok 11 - signed zero-length content S/MIME format, RSA key SHA1
# ------------------------------------------------------------------------------

    #   Failed test 'signed zero-length content S/MIME format, RSA key SHA1'
    #   at test/recipes/80-test_cms.t line 668.
    # CMD: openssl cms -provider-path ../../providers -provider default -sign -in ../../test/smcont.txt -nodetach -signer ../../test/smime-certs/smrsa1.pem -signer ../../test/smime-certs/smrsa2.pem -signer ../../test/smime-certs/smdsa1.pem -signer ../../test/smime-certs/smdsa2.pem -stream -out cms2cms-1-12.cms
../../util/wrap.pl ../../apps/openssl cms -provider-path ../../providers -provider default -sign -in ../../test/smcont.txt -nodetach -signer ../../test/smime-certs/smrsa1.pem -signer ../../test/smime-certs/smrsa2.pem -signer ../../test/smime-certs/smdsa1.pem -signer ../../test/smime-certs/smdsa2.pem -stream -out cms2cms-1-12.cms => 0
    # CMD: openssl cms -provider-path ../../providers -provider default -verify -in cms2cms-1-12.cms -CAfile ../../test/smime-certs/smroot.pem -out cms2cms-1-12.txt
CMS Verification failure
00F0F9B6:error:17000064:CMS routines:(unknown function):certificate verify error:crypto/cms/cms_smime.c:289:Verify error: certificate has expired
../../util/wrap.pl ../../apps/openssl cms -provider-path ../../providers -provider default -verify -in cms2cms-1-12.cms -CAfile ../../test/smime-certs/smroot.pem -out cms2cms-1-12.txt => 4
    not ok 12 - signed content test streaming S/MIME format, 2 DSA and 2 RSA keys
# ------------------------------------------------------------------------------

    #   Failed test 'signed content test streaming S/MIME format, 2 DSA and 2 RSA keys'
    #   at test/recipes/80-test_cms.t line 668.
    # CMD: openssl cms -provider-path ../../providers -provider default -sign -in ../../test/smcont.txt -signer ../../test/smime-certs/smrsa1.pem -signer ../../test/smime-certs/smrsa2.pem -signer ../../test/smime-certs/smdsa1.pem -signer ../../test/smime-certs/smdsa2.pem -stream -out cms2cms-1-13.cms
../../util/wrap.pl ../../apps/openssl cms -provider-path ../../providers -provider default -sign -in ../../test/smcont.txt -signer ../../test/smime-certs/smrsa1.pem -signer ../../test/smime-certs/smrsa2.pem -signer ../../test/smime-certs/smdsa1.pem -signer ../../test/smime-certs/smdsa2.pem -stream -out cms2cms-1-13.cms => 0
    # CMD: openssl cms -provider-path ../../providers -provider default -verify -in cms2cms-1-13.cms -CAfile ../../test/smime-certs/smroot.pem -out cms2cms-1-13.txt
CMS Verification failure
0080F2B6:error:17000064:CMS routines:(unknown function):certificate verify error:crypto/cms/cms_smime.c:289:Verify error: certificate has expired
../../util/wrap.pl ../../apps/openssl cms -provider-path ../../providers -provider default -verify -in cms2cms-1-13.cms -CAfile ../../test/smime-certs/smroot.pem -out cms2cms-1-13.txt => 4
    not ok 13 - signed content test streaming multipart S/MIME format, 2 DSA and 2 RSA keys
# ------------------------------------------------------------------------------
    # CMD: openssl cms -provider-path ../../providers -provider default -sign -in ../../test/smcont.txt -outform DER -nodetach -keyid -signer ../../test/smime-certs/smrsa1.pem -signer ../../test/smime-certs/smrsa2.pem -signer ../../test/smime-certs/smdsa1.pem -signer ../../test/smime-certs/smdsa2.pem -stream -out cms2cms-2-1.cms
../../util/wrap.pl ../../apps/openssl cms -provider-path ../../providers -provider default -sign -in ../../test/smcont.txt -outform DER -nodetach -keyid -signer ../../test/smime-certs/smrsa1.pem -signer ../../test/smime-certs/smrsa2.pem -signer ../../test/smime-certs/smdsa1.pem -signer ../../test/smime-certs/smdsa2.pem -stream -out cms2cms-2-1.cms => 0
    # CMD: openssl cms -provider-path ../../providers -provider default -verify -in cms2cms-2-1.cms -inform DER -CAfile ../../test/smime-certs/smroot.pem -out cms2cms-2-1.txt
CMS Verification failure
0070F5B6:error:17000064:CMS routines:(unknown function):certificate verify error:crypto/cms/cms_smime.c:289:Verify error: certificate has expired
../../util/wrap.pl ../../apps/openssl cms -provider-path ../../providers -provider default -verify -in cms2cms-2-1.cms -inform DER -CAfile ../../test/smime-certs/smroot.pem -out cms2cms-2-1.txt => 4
    not ok 18 - signed content test streaming BER format, 2 DSA and 2 RSA keys, keyid
# ------------------------------------------------------------------------------

    #   Failed test 'signed content test streaming BER format, 2 DSA and 2 RSA keys, keyid'
    #   at test/recipes/80-test_cms.t line 668.
    # CMD: openssl cms -provider-path ../../providers -provider default -sign -in ../../test/smcont.txt -outform PEM -nodetach -signer ../../test/smime-certs/smrsa1.pem -signer ../../test/smime-certs/smrsa2.pem -signer ../../test/smime-certs/smdsa1.pem -signer ../../test/smime-certs/smdsa2.pem -stream -out cms2cms-2-2.cms
../../util/wrap.pl ../../apps/openssl cms -provider-path ../../providers -provider default -sign -in ../../test/smcont.txt -outform PEM -nodetach -signer ../../test/smime-certs/smrsa1.pem -signer ../../test/smime-certs/smrsa2.pem -signer ../../test/smime-certs/smdsa1.pem -signer ../../test/smime-certs/smdsa2.pem -stream -out cms2cms-2-2.cms => 0
    # CMD: openssl cms -provider-path ../../providers -provider default -verify -in cms2cms-2-2.cms -inform PEM -CAfile ../../test/smime-certs/smroot.pem -out cms2cms-2-2.txt
CMS Verification failure
00B0FBB6:error:17000064:CMS routines:(unknown function):certificate verify error:crypto/cms/cms_smime.c:289:Verify error: certificate has expired
../../util/wrap.pl ../../apps/openssl cms -provider-path ../../providers -provider default -verify -in cms2cms-2-2.cms -inform PEM -CAfile ../../test/smime-certs/smroot.pem -out cms2cms-2-2.txt => 4
    not ok 19 - signed content test streaming PEM format, 2 DSA and 2 RSA keys
# ------------------------------------------------------------------------------

    #   Failed test 'signed content test streaming PEM format, 2 DSA and 2 RSA keys'
    #   at test/recipes/80-test_cms.t line 668.
    # CMD: openssl cms -provider-path ../../providers -provider default -sign -in ../../test/smcont.txt -nodetach -signer ../../test/smime-certs/smrsa1.pem -receipt_request_to test@openssl.org -receipt_request_all -out cms2cms-2-3.cms
../../util/wrap.pl ../../apps/openssl cms -provider-path ../../providers -provider default -sign -in ../../test/smcont.txt -nodetach -signer ../../test/smime-certs/smrsa1.pem -receipt_request_to test@openssl.org -receipt_request_all -out cms2cms-2-3.cms => 0
    # CMD: openssl cms -provider-path ../../providers -provider default -verify -in cms2cms-2-3.cms -CAfile ../../test/smime-certs/smroot.pem -out cms2cms-2-3.txt
CMS Verification failure
0060F5B6:error:17000064:CMS routines:(unknown function):certificate verify error:crypto/cms/cms_smime.c:289:Verify error: certificate has expired
../../util/wrap.pl ../../apps/openssl cms -provider-path ../../providers -provider default -verify -in cms2cms-2-3.cms -CAfile ../../test/smime-certs/smroot.pem -out cms2cms-2-3.txt => 4
    not ok 20 - signed content MIME format, RSA key, signed receipt request
# ------------------------------------------------------------------------------

    #   Failed test 'signed content MIME format, RSA key, signed receipt request'
    #   at test/recipes/80-test_cms.t line 668.
    # CMD: openssl cms -provider-path ../../providers -provider default -sign -in ../../test/smcont.txt -nodetach -signer ../../test/smime-certs/smrsa1.pem -receipt_request_to test@openssl.org -receipt_request_all -out cms2cms-2-4.cms
../../util/wrap.pl ../../apps/openssl cms -provider-path ../../providers -provider default -sign -in ../../test/smcont.txt -nodetach -signer ../../test/smime-certs/smrsa1.pem -receipt_request_to test@openssl.org -receipt_request_all -out cms2cms-2-4.cms => 0
    # CMD: openssl cms -provider-path ../../providers -provider default -sign_receipt -in cms2cms-2-4.cms -signer ../../test/smime-certs/smrsa2.pem -out cms2cms-2-42.cms
../../util/wrap.pl ../../apps/openssl cms -provider-path ../../providers -provider default -sign_receipt -in cms2cms-2-4.cms -signer ../../test/smime-certs/smrsa2.pem -out cms2cms-2-42.cms => 0
    # CMD: openssl cms -provider-path ../../providers -provider default -verify_receipt cms2cms-2-42.cms -in cms2cms-2-4.cms -CAfile ../../test/smime-certs/smroot.pem
Verification failure
0010F4B6:error:17000064:CMS routines:(unknown function):certificate verify error:crypto/cms/cms_smime.c:289:Verify error: certificate has expired
../../util/wrap.pl ../../apps/openssl cms -provider-path ../../providers -provider default -verify_receipt cms2cms-2-42.cms -in cms2cms-2-4.cms -CAfile ../../test/smime-certs/smroot.pem => 4
    not ok 21 - signed receipt MIME format, RSA key
# ------------------------------------------------------------------------------
    # Looks like you failed 17 tests of 30.
not ok 4 - CMS <=> CMS consistency tests
80-test_cms.t ...................... 4/? ---------------------------------------
    # CMD: openssl cms -provider-path ../../providers -provider default -sign -in ../../test/smcont.txt -outform PEM -nodetach -signer ../../test/smime-certs/smrsa1.pem -keyopt rsa_padding_mode:pss -out cms2cms-mod-1.cms
../../util/wrap.pl ../../apps/openssl cms -provider-path ../../providers -provider default -sign -in ../../test/smcont.txt -outform PEM -nodetach -signer ../../test/smime-certs/smrsa1.pem -keyopt 'rsa_padding_mode:pss' -out cms2cms-mod-1.cms => 0
    # CMD: openssl cms -provider-path ../../providers -provider default -verify -in cms2cms-mod-1.cms -inform PEM -CAfile ../../test/smime-certs/smroot.pem -out cms2cms-mod-1.txt
CMS Verification failure
00C0F1B6:error:17000064:CMS routines:(unknown function):certificate verify error:crypto/cms/cms_smime.c:289:Verify error: certificate has expired
../../util/wrap.pl ../../apps/openssl cms -provider-path ../../providers -provider default -verify -in cms2cms-mod-1.cms -inform PEM -CAfile ../../test/smime-certs/smroot.pem -out cms2cms-mod-1.txt => 4
    not ok 1 - signed content test streaming PEM format, RSA keys, PSS signature
# ------------------------------------------------------------------------------

    #   Failed test 'signed content test streaming PEM format, RSA keys, PSS signature'
    #   at test/recipes/80-test_cms.t line 668.
    # CMD: openssl cms -provider-path ../../providers -provider default -sign -in ../../test/smcont.txt -outform PEM -nodetach -signer ../../test/smime-certs/smrsa1.pem -keyopt rsa_padding_mode:pss -keyopt rsa_pss_saltlen:max -out cms2cms-mod-2.cms
../../util/wrap.pl ../../apps/openssl cms -provider-path ../../providers -provider default -sign -in ../../test/smcont.txt -outform PEM -nodetach -signer ../../test/smime-certs/smrsa1.pem -keyopt 'rsa_padding_mode:pss' -keyopt 'rsa_pss_saltlen:max' -out cms2cms-mod-2.cms => 0
    # CMD: openssl cms -provider-path ../../providers -provider default -verify -in cms2cms-mod-2.cms -inform PEM -CAfile ../../test/smime-certs/smroot.pem -out cms2cms-mod-2.txt
CMS Verification failure
00D0EFB6:error:17000064:CMS routines:(unknown function):certificate verify error:crypto/cms/cms_smime.c:289:Verify error: certificate has expired
../../util/wrap.pl ../../apps/openssl cms -provider-path ../../providers -provider default -verify -in cms2cms-mod-2.cms -inform PEM -CAfile ../../test/smime-certs/smroot.pem -out cms2cms-mod-2.txt => 4
    not ok 2 - signed content test streaming PEM format, RSA keys, PSS signature, saltlen=max
# ------------------------------------------------------------------------------

    #   Failed test 'signed content test streaming PEM format, RSA keys, PSS signature, saltlen=max'
    #   at test/recipes/80-test_cms.t line 668.
    # CMD: openssl cms -provider-path ../../providers -provider default -sign -in ../../test/smcont.txt -outform PEM -nodetach -noattr -signer ../../test/smime-certs/smrsa1.pem -keyopt rsa_padding_mode:pss -out cms2cms-mod-3.cms
../../util/wrap.pl ../../apps/openssl cms -provider-path ../../providers -provider default -sign -in ../../test/smcont.txt -outform PEM -nodetach -noattr -signer ../../test/smime-certs/smrsa1.pem -keyopt 'rsa_padding_mode:pss' -out cms2cms-mod-3.cms => 0
    # CMD: openssl cms -provider-path ../../providers -provider default -verify -in cms2cms-mod-3.cms -inform PEM -CAfile ../../test/smime-certs/smroot.pem -out cms2cms-mod-3.txt
CMS Verification failure
0050F2B6:error:17000064:CMS routines:(unknown function):certificate verify error:crypto/cms/cms_smime.c:289:Verify error: certificate has expired
../../util/wrap.pl ../../apps/openssl cms -provider-path ../../providers -provider default -verify -in cms2cms-mod-3.cms -inform PEM -CAfile ../../test/smime-certs/smroot.pem -out cms2cms-mod-3.txt => 4
    not ok 3 - signed content test streaming PEM format, RSA keys, PSS signature, no attributes
# ------------------------------------------------------------------------------

    #   Failed test 'signed content test streaming PEM format, RSA keys, PSS signature, no attributes'
    #   at test/recipes/80-test_cms.t line 668.
    # CMD: openssl cms -provider-path ../../providers -provider default -sign -in ../../test/smcont.txt -outform PEM -nodetach -signer ../../test/smime-certs/smrsa1.pem -keyopt rsa_padding_mode:pss -keyopt rsa_mgf1_md:sha384 -out cms2cms-mod-4.cms
../../util/wrap.pl ../../apps/openssl cms -provider-path ../../providers -provider default -sign -in ../../test/smcont.txt -outform PEM -nodetach -signer ../../test/smime-certs/smrsa1.pem -keyopt 'rsa_padding_mode:pss' -keyopt 'rsa_mgf1_md:sha384' -out cms2cms-mod-4.cms => 0
    # CMD: openssl cms -provider-path ../../providers -provider default -verify -in cms2cms-mod-4.cms -inform PEM -CAfile ../../test/smime-certs/smroot.pem -out cms2cms-mod-4.txt
CMS Verification failure
00E0FCB6:error:17000064:CMS routines:(unknown function):certificate verify error:crypto/cms/cms_smime.c:289:Verify error: certificate has expired
../../util/wrap.pl ../../apps/openssl cms -provider-path ../../providers -provider default -verify -in cms2cms-mod-4.cms -inform PEM -CAfile ../../test/smime-certs/smroot.pem -out cms2cms-mod-4.txt => 4
    not ok 4 - signed content test streaming PEM format, RSA keys, PSS signature, SHA384 MGF1
# ------------------------------------------------------------------------------
    # Looks like you failed 4 tests of 14.
not ok 5 - CMS <=> CMS consistency tests, modified key parameters
80-test_cms.t ...................... 5/? ---------------------------------------
    # CMD: openssl cms -provider-path ../../providers -provider default -sign -binary -nodetach -stream -in ../../test/smcont.txt -outform DER -signer ../../test/smime-certs/smrsa1.pem -md SHA256 -out cms2cms-added-1.cms
../../util/wrap.pl ../../apps/openssl cms -provider-path ../../providers -provider default -sign -binary -nodetach -stream -in ../../test/smcont.txt -outform DER -signer ../../test/smime-certs/smrsa1.pem -md SHA256 -out cms2cms-added-1.cms => 0
    # CMD: openssl cms -provider-path ../../providers -provider default -resign -binary -nodetach -in cms2cms-added-1.cms -inform DER -outform DER -signer ../../test/smime-certs/smrsa2.pem -md SHA256 -out cms2cms-added-12.cms
../../util/wrap.pl ../../apps/openssl cms -provider-path ../../providers -provider default -resign -binary -nodetach -in cms2cms-added-1.cms -inform DER -outform DER -signer ../../test/smime-certs/smrsa2.pem -md SHA256 -out cms2cms-added-12.cms => 0
    # CMD: openssl cms -provider-path ../../providers -provider default -verify -in cms2cms-added-12.cms -inform DER -CAfile ../../test/smime-certs/smroot.pem -out cms2cms-added-1.txt
CMS Verification failure
0000F9B6:error:17000064:CMS routines:(unknown function):certificate verify error:crypto/cms/cms_smime.c:289:Verify error: certificate has expired
../../util/wrap.pl ../../apps/openssl cms -provider-path ../../providers -provider default -verify -in cms2cms-added-12.cms -inform DER -CAfile ../../test/smime-certs/smroot.pem -out cms2cms-added-1.txt => 4
    not ok 1 - signed content test - check that content type is added to additional signerinfo, RSA keys
# ------------------------------------------------------------------------------

    #   Failed test 'signed content test - check that content type is added to additional signerinfo, RSA keys'
    #   at test/recipes/80-test_cms.t line 668.
    # Looks like you failed 1 test of 1.
not ok 6 - CMS Check the content type attribute is added for additional signers
80-test_cms.t ...................... 7/? ---------------------------------------
    # CMD: openssl cms -provider-path ../../providers -provider default -sign -cades -in ../../test/smcont.txt -outform DER -nodetach -certfile ../../test/smime-certs/smroot.pem -signer ../../test/smime-certs/smrsa1.pem -out cms-cades-1.cms
../../util/wrap.pl ../../apps/openssl cms -provider-path ../../providers -provider default -sign -cades -in ../../test/smcont.txt -outform DER -nodetach -certfile ../../test/smime-certs/smroot.pem -signer ../../test/smime-certs/smrsa1.pem -out cms-cades-1.cms => 0
    # CMD: openssl cms -provider-path ../../providers -provider default -verify -cades -in cms-cades-1.cms -inform DER -CAfile ../../test/smime-certs/smroot.pem -out cms-cades-1.txt
CAdES Verification failure
0090FDB6:error:17000064:CMS routines:(unknown function):certificate verify error:crypto/cms/cms_smime.c:289:Verify error: certificate has expired
../../util/wrap.pl ../../apps/openssl cms -provider-path ../../providers -provider default -verify -cades -in cms-cades-1.cms -inform DER -CAfile ../../test/smime-certs/smroot.pem -out cms-cades-1.txt => 4
    not ok 1 - signed content DER format, RSA key, CAdES-BES compatible
# ------------------------------------------------------------------------------

    #   Failed test 'signed content DER format, RSA key, CAdES-BES compatible'
    #   at test/recipes/80-test_cms.t line 668.
    # CMD: openssl cms -provider-path ../../providers -provider default -sign -cades -md sha256 -in ../../test/smcont.txt -outform DER -nodetach -certfile ../../test/smime-certs/smroot.pem -signer ../../test/smime-certs/smrsa1.pem -out cms-cades-2.cms
../../util/wrap.pl ../../apps/openssl cms -provider-path ../../providers -provider default -sign -cades -md sha256 -in ../../test/smcont.txt -outform DER -nodetach -certfile ../../test/smime-certs/smroot.pem -signer ../../test/smime-certs/smrsa1.pem -out cms-cades-2.cms => 0
    # CMD: openssl cms -provider-path ../../providers -provider default -verify -cades -in cms-cades-2.cms -inform DER -CAfile ../../test/smime-certs/smroot.pem -out cms-cades-2.txt
CAdES Verification failure
00A0F6B6:error:17000064:CMS routines:(unknown function):certificate verify error:crypto/cms/cms_smime.c:289:Verify error: certificate has expired
../../util/wrap.pl ../../apps/openssl cms -provider-path ../../providers -provider default -verify -cades -in cms-cades-2.cms -inform DER -CAfile ../../test/smime-certs/smroot.pem -out cms-cades-2.txt => 4
    not ok 2 - signed content DER format, RSA key, SHA256 md, CAdES-BES compatible
# ------------------------------------------------------------------------------

    #   Failed test 'signed content DER format, RSA key, SHA256 md, CAdES-BES compatible'
    #   at test/recipes/80-test_cms.t line 668.
    # CMD: openssl cms -provider-path ../../providers -provider default -sign -cades -md sha512 -in ../../test/smcont.txt -outform DER -nodetach -certfile ../../test/smime-certs/smroot.pem -signer ../../test/smime-certs/smrsa1.pem -out cms-cades-3.cms
../../util/wrap.pl ../../apps/openssl cms -provider-path ../../providers -provider default -sign -cades -md sha512 -in ../../test/smcont.txt -outform DER -nodetach -certfile ../../test/smime-certs/smroot.pem -signer ../../test/smime-certs/smrsa1.pem -out cms-cades-3.cms => 0
    # CMD: openssl cms -provider-path ../../providers -provider default -verify -cades -in cms-cades-3.cms -inform DER -CAfile ../../test/smime-certs/smroot.pem -out cms-cades-3.txt
CAdES Verification failure
0060F1B6:error:17000064:CMS routines:(unknown function):certificate verify error:crypto/cms/cms_smime.c:289:Verify error: certificate has expired
../../util/wrap.pl ../../apps/openssl cms -provider-path ../../providers -provider default -verify -cades -in cms-cades-3.cms -inform DER -CAfile ../../test/smime-certs/smroot.pem -out cms-cades-3.txt => 4
    not ok 3 - signed content DER format, RSA key, SHA512 md, CAdES-BES compatible
# ------------------------------------------------------------------------------

    #   Failed test 'signed content DER format, RSA key, SHA512 md, CAdES-BES compatible'
    #   at test/recipes/80-test_cms.t line 668.
    # CMD: openssl cms -provider-path ../../providers -provider default -sign -cades -binary -nodetach -nosmimecap -md sha256 -in ../../test/smcont.txt -outform DER -certfile ../../test/smime-certs/smroot.pem -signer ../../test/smime-certs/smrsa1.pem -outform DER -out cms-cades-4.cms
../../util/wrap.pl ../../apps/openssl cms -provider-path ../../providers -provider default -sign -cades -binary -nodetach -nosmimecap -md sha256 -in ../../test/smcont.txt -outform DER -certfile ../../test/smime-certs/smroot.pem -signer ../../test/smime-certs/smrsa1.pem -outform DER -out cms-cades-4.cms => 0
    # CMD: openssl cms -provider-path ../../providers -provider default -verify -cades -in cms-cades-4.cms -inform DER -CAfile ../../test/smime-certs/smroot.pem -out cms-cades-4.txt
CAdES Verification failure
0050F4B6:error:17000064:CMS routines:(unknown function):certificate verify error:crypto/cms/cms_smime.c:289:Verify error: certificate has expired
../../util/wrap.pl ../../apps/openssl cms -provider-path ../../providers -provider default -verify -cades -in cms-cades-4.cms -inform DER -CAfile ../../test/smime-certs/smroot.pem -out cms-cades-4.txt => 4
    not ok 4 - signed content DER format, RSA key, SHA256 md, CAdES-BES compatible
# ------------------------------------------------------------------------------

    #   Failed test 'signed content DER format, RSA key, SHA256 md, CAdES-BES compatible'
    #   at test/recipes/80-test_cms.t line 668.
    # CMD: openssl cms -provider-path ../../providers -provider default -sign -cades -binary -nodetach -nosmimecap -md sha256 -in ../../test/smcont.txt -outform DER -certfile ../../test/smime-certs/smroot.pem -signer ../../test/smime-certs/smrsa1.pem -outform DER -out cms-cades-5.cms
../../util/wrap.pl ../../apps/openssl cms -provider-path ../../providers -provider default -sign -cades -binary -nodetach -nosmimecap -md sha256 -in ../../test/smcont.txt -outform DER -certfile ../../test/smime-certs/smroot.pem -signer ../../test/smime-certs/smrsa1.pem -outform DER -out cms-cades-5.cms => 0
    # CMD: openssl cms -provider-path ../../providers -provider default -resign -cades -binary -nodetach -nosmimecap -md sha256 -inform DER -in cms-cades-5.cms -certfile ../../test/smime-certs/smroot.pem -signer ../../test/smime-certs/smrsa2.pem -outform DER -out cms-cades-52.cms
../../util/wrap.pl ../../apps/openssl cms -provider-path ../../providers -provider default -resign -cades -binary -nodetach -nosmimecap -md sha256 -inform DER -in cms-cades-5.cms -certfile ../../test/smime-certs/smroot.pem -signer ../../test/smime-certs/smrsa2.pem -outform DER -out cms-cades-52.cms => 0
    # CMD: openssl cms -provider-path ../../providers -provider default -verify -cades -in cms-cades-52.cms -inform DER -CAfile ../../test/smime-certs/smroot.pem -out cms-cades-5.txt
CAdES Verification failure
00B0FDB6:error:17000064:CMS routines:(unknown function):certificate verify error:crypto/cms/cms_smime.c:289:Verify error: certificate has expired
../../util/wrap.pl ../../apps/openssl cms -provider-path ../../providers -provider default -verify -cades -in cms-cades-52.cms -inform DER -CAfile ../../test/smime-certs/smroot.pem -out cms-cades-5.txt => 4
    not ok 5 - resigned content DER format, RSA key, SHA256 md, CAdES-BES compatible
# ------------------------------------------------------------------------------

    #   Failed test 'resigned content DER format, RSA key, SHA256 md, CAdES-BES compatible'
    #   at test/recipes/80-test_cms.t line 668.
    # Looks like you failed 5 tests of 5.
not ok 9 - CAdES <=> CAdES consistency tests
80-test_cms.t ...................... 11/? --------------------------------------
CMS Verification failure
00E0FDB6:error:17000064:CMS routines:(unknown function):certificate verify error:crypto/cms/cms_smime.c:289:Verify error: certificate has expired
../../util/wrap.pl ../../apps/openssl cms -verify -CAfile ../../test/smime-certs/smroot.pem -binary -in smcont.signed -out smcont.verified => 4
    not ok 2 - verify binary input with -binary
# ------------------------------------------------------------------------------

    #   Failed test 'verify binary input with -binary'
    #   at test/recipes/80-test_cms.t line 820.
    not ok 3 - binary input retained with -binary
# ------------------------------------------------------------------------------
CMS Verification failure
0080F3B6:error:17000064:CMS routines:(unknown function):certificate verify error:crypto/cms/cms_smime.c:289:Verify error: certificate has expired
../../util/wrap.pl ../../apps/openssl cms -verify -CAfile ../../test/smime-certs/smroot.pem -in smcont.signed.nobin -out smcont.verified.nobin => 4
    not ok 5 - verify binary input without -binary
# ------------------------------------------------------------------------------
CMS Verification failure
0010F6B6:error:17000064:CMS routines:(unknown function):certificate verify error:crypto/cms/cms_smime.c:289:Verify error: certificate has expired
../../util/wrap.pl ../../apps/openssl cms -verify -CAfile ../../test/smime-certs/smroot.pem -crlfeol -binary -in smcont.signed.crlf -out smcont.verified.crlf => 4
    not ok 9 - verify binary input with -binary -crlfeol
# ------------------------------------------------------------------------------

    #   Failed test 'verify binary input with -binary -crlfeol'
    #   at test/recipes/80-test_cms.t line 840.
    not ok 10 - binary input retained with -binary -crlfeol
# ------------------------------------------------------------------------------
    # Looks like you failed 5 tests of 11.
not ok 12 - CMS binary input tests
80-test_cms.t ...................... 12/? --------------------------------------
#
#   Failed test 'CMS binary input tests
# '
#   at /root/python3/openssl-3.0.0/util/perl/OpenSSL/Test.pm line 1296.
80-test_cms.t ...................... Dubious, test returned 7 (wstat 1792, 0x700)
Failed 7/12 subtests
80-test_cmsapi.t ................... ok
80-test_ct.t ....................... ok
80-test_dane.t ..................... ok
80-test_dtls.t ..................... ok
80-test_dtls_mtu.t ................. ok
80-test_dtlsv1listen.t ............. ok
80-test_ocsp.t ..................... ok
80-test_pkcs12.t ................... ok
80-test_ssl_new.t .................. 11/?
            # ERROR: (int) 'result->result == test_ctx->expected_result' failed @ test/ssl_test.c:36
            # [2] compared to [0]
            # INFO:
            # ExpectedResult mismatch: expected Success, got ClientFail.
            # 0050F5B6:error:0A000415:SSL routines:(unknown function):sslv3 alert certificate expired:ssl/record/rec_layer_s3.c:1584:SSL alert number 45
            # OPENSSL_TEST_RAND_ORDER=1687669181
            not ok 2 - iteration 2
# ------------------------------------------------------------------------------
            # ERROR: (int) 'result->result == test_ctx->expected_result' failed @ test/ssl_test.c:36
            # [2] compared to [0]
            # INFO:
            # ExpectedResult mismatch: expected Success, got ClientFail.
            # 0050F5B6:error:0A000415:SSL routines:(unknown function):sslv3 alert certificate expired:ssl/record/rec_layer_s3.c:1584:SSL alert number 45
            # OPENSSL_TEST_RAND_ORDER=1687669181
            not ok 4 - iteration 4
# ------------------------------------------------------------------------------
            # ERROR: (int) 'result->result == test_ctx->expected_result' failed @ test/ssl_test.c:36
            # [4] compared to [0]
            # INFO:
            # ExpectedResult mismatch: expected Success, got FirstHandshakeFailed.
            # 0050F5B6:error:0A000415:SSL routines:(unknown function):sslv3 alert certificate expired:ssl/record/rec_layer_s3.c:1584:SSL alert number 45
            # OPENSSL_TEST_RAND_ORDER=1687669181
            not ok 5 - iteration 5
# ------------------------------------------------------------------------------
            # ERROR: (int) 'result->result == test_ctx->expected_result' failed @ test/ssl_test.c:36
            # [4] compared to [0]
            # INFO:
            # ExpectedResult mismatch: expected Success, got FirstHandshakeFailed.
            # 0050F5B6:error:0A000415:SSL routines:(unknown function):sslv3 alert certificate expired:ssl/record/rec_layer_s3.c:1584:SSL alert number 45
            # OPENSSL_TEST_RAND_ORDER=1687669181
            not ok 6 - iteration 6
# ------------------------------------------------------------------------------
        # OPENSSL_TEST_RAND_ORDER=1687669181
        not ok 1 - test_handshake
# ------------------------------------------------------------------------------
../../util/wrap.pl ../../test/ssl_test 12-ct.cnf.none none => 1
    not ok 3 - running ssl_test 12-ct.cnf
# ------------------------------------------------------------------------------
            # ERROR: (int) 'result->result == test_ctx->expected_result' failed @ test/ssl_test.c:36
            # [2] compared to [0]
            # INFO:
            # ExpectedResult mismatch: expected Success, got ClientFail.
            # 0010F6B6:error:0A000415:SSL routines:(unknown function):sslv3 alert certificate expired:ssl/record/rec_layer_s3.c:1584:SSL alert number 45
            # OPENSSL_TEST_RAND_ORDER=1687669184
            not ok 2 - iteration 2
# ------------------------------------------------------------------------------
            # ERROR: (int) 'result->result == test_ctx->expected_result' failed @ test/ssl_test.c:36
            # [2] compared to [0]
            # INFO:
            # ExpectedResult mismatch: expected Success, got ClientFail.
            # 0010F6B6:error:0A000415:SSL routines:(unknown function):sslv3 alert certificate expired:ssl/record/rec_layer_s3.c:1584:SSL alert number 45
            # OPENSSL_TEST_RAND_ORDER=1687669184
            not ok 4 - iteration 4
# ------------------------------------------------------------------------------
            # ERROR: (int) 'result->result == test_ctx->expected_result' failed @ test/ssl_test.c:36
            # [4] compared to [0]
            # INFO:
            # ExpectedResult mismatch: expected Success, got FirstHandshakeFailed.
            # 0010F6B6:error:0A000415:SSL routines:(unknown function):sslv3 alert certificate expired:ssl/record/rec_layer_s3.c:1584:SSL alert number 45
            # OPENSSL_TEST_RAND_ORDER=1687669184
            not ok 5 - iteration 5
# ------------------------------------------------------------------------------
            # ERROR: (int) 'result->result == test_ctx->expected_result' failed @ test/ssl_test.c:36
            # [4] compared to [0]
            # INFO:
            # ExpectedResult mismatch: expected Success, got FirstHandshakeFailed.
            # 0010F6B6:error:0A000415:SSL routines:(unknown function):sslv3 alert certificate expired:ssl/record/rec_layer_s3.c:1584:SSL alert number 45
            # OPENSSL_TEST_RAND_ORDER=1687669184
            not ok 6 - iteration 6
# ------------------------------------------------------------------------------
        # OPENSSL_TEST_RAND_ORDER=1687669184
        not ok 1 - test_handshake
# ------------------------------------------------------------------------------
../../util/wrap.pl ../../test/ssl_test 12-ct.cnf.default default => 1
    not ok 6 - running ssl_test 12-ct.cnf
# ------------------------------------------------------------------------------

    #   Failed test 'running ssl_test 12-ct.cnf'
    #   at test/recipes/80-test_ssl_new.t line 171.
    # Looks like you failed 2 tests of 6.
not ok 12 - Test configuration 12-ct.cnf
80-test_ssl_new.t .................. 30/? --------------------------------------
80-test_ssl_new.t .................. Dubious, test returned 1 (wstat 256, 0x100)
Failed 1/30 subtests
80-test_ssl_old.t .................. ok
80-test_ssl_test_ctx.t ............. ok
80-test_sslcorrupt.t ............... ok
80-test_tsa.t ...................... ok
80-test_x509aux.t .................. ok
81-test_cmp_cli.t .................. ok
90-test_asn1_time.t ................ ok
90-test_async.t .................... ok
90-test_bio_enc.t .................. ok
90-test_bio_memleak.t .............. ok
90-test_constant_time.t ............ ok
90-test_fatalerr.t ................. ok
90-test_fipsload.t ................. skipped: Test is disabled with disabled fips
90-test_gmdiff.t ................... ok
90-test_ige.t ...................... ok
90-test_includes.t ................. ok
90-test_memleak.t .................. ok
90-test_overhead.t ................. ok
90-test_secmem.t ................... ok
90-test_shlibload.t ................ ok
90-test_srp.t ...................... ok
90-test_sslapi.t ................... ok
90-test_sslbuffers.t ............... ok
90-test_store.t .................... ok
90-test_sysdefault.t ............... ok
90-test_threads.t .................. ok
90-test_time_offset.t .............. ok
90-test_tls13ccs.t ................. ok
90-test_tls13encryption.t .......... ok
90-test_tls13secrets.t ............. ok
90-test_v3name.t ................... ok
91-test_pkey_check.t ............... ok
95-test_external_gost_engine.t ..... skipped: No external tests in this configuration
95-test_external_krb5.t ............ skipped: No external tests in this configuration
95-test_external_pyca.t ............ skipped: No external tests in this configuration
99-test_ecstress.t ................. ok
99-test_fuzz_asn1.t ................ ok
99-test_fuzz_asn1parse.t ........... ok
99-test_fuzz_bignum.t .............. ok
99-test_fuzz_bndiv.t ............... ok
99-test_fuzz_client.t .............. ok
99-test_fuzz_cmp.t ................. ok
99-test_fuzz_cms.t ................. ok
99-test_fuzz_conf.t ................ ok
99-test_fuzz_crl.t ................. ok
99-test_fuzz_ct.t .................. ok
99-test_fuzz_server.t .............. ok
99-test_fuzz_x509.t ................ ok

Test Summary Report
-------------------
25-test_verify.t                 (Wstat: 512 Tests: 159 Failed: 2)
  Failed tests:  156-157
  Non-zero exit status: 2
80-test_cms.t                    (Wstat: 1792 Tests: 12 Failed: 7)
  Failed tests:  2-6, 9, 12
  Non-zero exit status: 7
80-test_ssl_new.t                (Wstat: 256 Tests: 30 Failed: 1)
  Failed test:  12
  Non-zero exit status: 1
Files=241, Tests=3273, 5546 wallclock secs (90.15 usr  3.34 sys + 5040.77 cusr 366.34 csys = 5500.60 CPU)
Result: FAIL
Makefile:3229: recipe for target 'run_tests' failed
make[1]: *** [run_tests] Error 1
make[1]: Leaving directory '/root/python3/openssl-3.0.0'
Makefile:3226: recipe for target 'tests' failed
make: *** [tests] Error 2

 

Link to comment
Share on other sites

Still getting the same exact error numbers from maketest:

Test Summary Report
-------------------
25-test_verify.t                 (Wstat: 512 Tests: 159 Failed: 2)
  Failed tests:  156-157
  Non-zero exit status: 2
80-test_cms.t                    (Wstat: 1792 Tests: 12 Failed: 7)
  Failed tests:  2-6, 9, 12
  Non-zero exit status: 7
80-test_ssl_new.t                (Wstat: 256 Tests: 30 Failed: 1)
  Failed test:  12
  Non-zero exit status: 1
Files=241, Tests=3273, 3919 wallclock secs (68.94 usr  2.56 sys + 3532.41 cusr 261.23 csys = 3865.14 CPU)
Result: FAIL
Makefile:3226: recipe for target 'run_tests' failed
make[1]: *** [run_tests] Error 1
make[1]: Leaving directory '/root/python3/openssl-3.0.0'
Makefile:3223: recipe for target 'tests' failed

 

Link to comment
Share on other sites

Using 3.0.9 will work. The certs in 3.0.0 aren't valid anymore.

However, you will most likely have issues later on for other reasons.

Trying to get tools working is a cat and mouse game, especially on a platform that is EOL in its LTS release (Debian Jessie).

The instruction I wrote is 2 years old in November so it's no real surprise that issues might arise over time.

Link to comment
Share on other sites

Archived

This topic is now archived and is closed to further replies.

  • Recently Browsing   0 members

    • No registered users viewing this page.
×
×
  • Create New...